program: Orca
programVersion: 5.0.2
elementType: S O O O N N N N C C C C C C C C C C C C C C C C H H H H H H H H H H H H H H H H H H H H H H
charge: 0
multiplicity: 1
keywords: wb97x-d3
keywords: def2-TZVPP
keywords: def2/J RIJCOSX
keywords: DEFGRID2
keywords: scfconv7
keywords: smallprint printgap noloewdin
keywords: NOSOSCF
formula: C16H22N4O3S
InChI: InChI=1/C16H22N4O3S/c1-6-19(7-2)16(21)20-10-17-15(18-20)24(22,23)14-12(4)8-11(3)9-13(14)5/h8-10H,6-7H2,1-5H3
46 atoms
S  1.190312 1.392361 -0.949341
O  0.921934 2.512376 -0.062391
O  1.304004 1.663461 -2.372763
O  -3.308793 -2.086716 0.791874
N  -3.898029 0.110714 0.87248
N  -1.919079 -0.610537 -0.194518
N  -1.174707 0.480467 -0.00822
N  -0.177841 -0.920308 -1.452857
C  2.57063 0.43404 -0.361286
C  3.511386 -0.102362 -1.260376
C  2.656953 0.196224 1.026979
C  4.665566 -1.118049 0.634354
C  4.545378 -0.864168 -0.722769
C  3.709798 -0.582451 1.48701
C  -0.155368 0.24425 -0.780633
C  3.514192 0.055951 -2.756655
C  1.698808 0.713676 2.065242
C  -5.033616 -0.184405 1.746414
C  -3.903323 1.423184 0.21219
C  -3.119105 -0.916036 0.534304
C  5.798699 -1.934461 1.170695
C  -1.300971 -1.448233 -1.052329
C  -6.30285 -0.537617 0.992289
C  -4.183899 1.365052 -1.278968
H  5.278972 -1.284037 -1.400934
H  3.78016 -0.779081 2.550508
H  -4.757546 -0.989875 2.424354
H  -5.195261 0.699248 2.364616
H  -4.692485 1.992875 0.699591
H  -2.976462 1.954742 0.414707
H  4.339424 -0.520485 -3.170741
H  2.5985 -0.309853 -3.217958
H  3.653255 1.090421 -3.06568
H  0.651979 0.523618 1.832256
H  1.904388 0.223795 3.015519
H  1.810003 1.786056 2.220969
H  5.471703 -2.590148 1.977965
H  6.254519 -2.549291 0.395655
H  6.579542 -1.28875 1.578744
H  -1.708859 -2.399889 -1.353994
H  -6.636785 0.281584 0.353935
H  -6.167219 -1.42346 0.37133
H  -7.104274 -0.746714 1.702119
H  -3.386064 0.885496 -1.846144
H  -5.113998 0.836884 -1.490074
H  -4.28286 2.38088 -1.663094
elementType: S O N C H
totalener: -1465.94651937 hartree
nucrepener: 2354.93782681 hartree
electener: -3820.88434619 hartree
oneelecener: -6684.38586305 hartree
twoeener: 2863.50151686 hartree
cpcmener: -0.03661068 hartree
kineticenergy: 1460.48359768 hartree
xcener: -121.651200612859 hartree
chargesum: -0.0000000
charge: 0.870197 -0.526001 -0.530142 -0.480920 -0.134265 0.112404 -0.308492 -0.374620 -0.287991 0.166891 0.138408 0.069210 -0.219061 -0.225908 0.145520 -0.197450 -0.246851 -0.023057 -0.066064 0.392731 -0.206795 0.118540 -0.264317 -0.255503 0.121061 0.121142 0.092623 0.096597 0.103393 0.120446 0.089780 0.099386 0.107060 0.121567 0.094696 0.114690 0.101106 0.096536 0.108784 0.181565 0.089026 0.089975 0.101107 0.089892 0.092541 0.100561
qa: 0.8702 -0.5260 -0.5301 -0.4809 -0.1343 0.1124 -0.3085 -0.3746 -0.2880 0.1669 0.1384 0.0692 -0.2191 -0.2259 0.1455 -0.1975 -0.2469 -0.0231 -0.0661 0.3927 -0.2068 0.1185 -0.2643 -0.2555 0.1211 0.1211 0.0926 0.0966 0.1034 0.1204 0.0898 0.0994 0.1071 0.1216 0.0947 0.1147 0.1011 0.0965 0.1088 0.1816 0.0890 0.0900 0.1011 0.0899 0.0925 0.1006
va: 5.5967 1.9532 1.9593 2.0319 3.2182 3.3266 2.8448 3.0725 3.6938 3.6227 3.6561 3.7142 3.9784 3.9918 4.0057 3.8552 3.8863 3.8593 3.8551 4.2571 3.8957 4.0345 3.9147 3.9296 1.0119 1.0118 1.0140 1.0005 0.9935 1.0134 1.0049 1.0123 1.0042 0.9983 1.0057 1.0001 0.9997 1.0039 0.9942 0.9957 1.0009 1.0076 1.0076 1.0044 1.0010 1.0088
dispcorr: -0.024013155 hartree
energy: -1465.970532528587
dipole: -10.06277 9.06888 -0.99390 -3.49289 2.37063 -1.12226 6.94359 -5.68260 1.26099
magnitude: 1.95893 au
magnitude: 4.97921 debye
