program: Orca
programVersion: 5.0.2
elementType: S O O O N N N N C C C C C C C C C C C C C C C C H H H H H H H H H H H H H H H H H H H H H H
charge: 0
multiplicity: 1
keywords: wb97x-d3
keywords: def2-TZVPP
keywords: def2/J RIJCOSX
keywords: DEFGRID2
keywords: scfconv7
keywords: smallprint printgap noloewdin
keywords: NOSOSCF
formula: C16H22N4O3S
InChI: InChI=1/C16H22N4O3S/c1-6-19(7-2)16(21)20-10-17-15(18-20)24(22,23)14-12(4)8-11(3)9-13(14)5/h8-10H,6-7H2,1-5H3
46 atoms
S  1.15067 1.211925 1.193718
O  1.568134 1.314366 2.581877
O  0.729529 2.430023 0.520857
O  -4.050814 -1.707319 0.965054
N  -3.758161 -0.42339 -0.879048
N  -2.016269 -0.778889 0.692379
N  -1.306086 0.331815 0.488107
N  -0.166191 -1.10978 1.776788
C  2.361451 0.337563 0.222463
C  3.324287 -0.473353 0.856503
C  2.288097 0.43289 -1.181834
C  4.227331 -1.030429 -1.338542
C  4.24157 -1.131254 0.044995
C  3.236483 -0.258758 -1.926382
C  -0.217001 0.0799 1.152871
C  3.444362 -0.724429 2.335366
C  1.258046 1.203892 -1.9629
C  -5.187238 -0.51866 -1.193422
C  -2.908397 0.199871 -1.893121
C  -3.36731 -0.998548 0.254789
C  5.254449 -1.732086 -2.169594
C  -1.324396 -1.628295 1.479855
C  -6.060864 0.37443 -0.332215
C  -3.017708 1.711024 -1.917923
H  4.988451 -1.75795 0.517939
H  3.189965 -0.195767 -3.007206
H  -5.294735 -0.236167 -2.239196
H  -5.509161 -1.55829 -1.119157
H  -1.876866 -0.113439 -1.762387
H  -3.223841 -0.211298 -2.85366
H  3.775784 0.156236 2.881961
H  2.510146 -1.061459 2.780017
H  4.183301 -1.50636 2.501301
H  1.312132 0.908747 -3.009306
H  0.23633 1.022107 -1.632808
H  1.430776 2.277918 -1.919011
H  6.153814 -1.119519 -2.264187
H  5.555312 -2.678503 -1.720848
H  4.889715 -1.931053 -3.176756
H  -1.695658 -2.5923 1.788528
H  -7.097246 0.290213 -0.661189
H  -6.028098 0.095073 0.719968
H  -5.767363 1.420672 -0.418128
H  -2.704761 2.14915 -0.971594
H  -2.378236 2.112014 -2.704981
H  -4.036694 2.037794 -2.12967
elementType: S O N C H
totalener: -1465.94694147 hartree
nucrepener: 2373.55331867 hartree
electener: -3839.50026014 hartree
oneelecener: -6721.21468689 hartree
twoeener: 2881.71442675 hartree
cpcmener: -0.03750274 hartree
kineticenergy: 1460.49787909 hartree
xcener: -121.655271107440 hartree
chargesum: 0.0000000
charge: 0.866312 -0.528538 -0.525468 -0.488753 -0.119863 0.121156 -0.303194 -0.380814 -0.300982 0.163137 0.160947 0.070258 -0.226666 -0.231741 0.146878 -0.204808 -0.188908 -0.036637 -0.036889 0.392087 -0.208263 0.119607 -0.254261 -0.279534 0.120994 0.120948 0.097417 0.098659 0.107962 0.104065 0.106966 0.101616 0.089510 0.095041 0.062816 0.115898 0.109400 0.099808 0.097523 0.179761 0.098937 0.090860 0.085948 0.094627 0.098761 0.097424
qa: 0.8663 -0.5285 -0.5255 -0.4888 -0.1199 0.1212 -0.3032 -0.3808 -0.3010 0.1631 0.1609 0.0703 -0.2267 -0.2317 0.1469 -0.2048 -0.1889 -0.0366 -0.0369 0.3921 -0.2083 0.1196 -0.2543 -0.2795 0.1210 0.1209 0.0974 0.0987 0.1080 0.1041 0.1070 0.1016 0.0895 0.0950 0.0628 0.1159 0.1094 0.0998 0.0975 0.1798 0.0989 0.0909 0.0859 0.0946 0.0988 0.0974
va: 5.5900 1.9570 1.9559 2.0263 3.2330 3.3403 2.9205 3.0728 3.7149 3.6375 3.6414 3.7153 3.9837 3.9918 4.0375 3.8520 3.8760 3.8583 3.8531 4.2573 3.8957 4.0372 3.9116 3.8882 1.0114 1.0121 0.9996 1.0108 0.9947 0.9987 1.0035 1.0187 1.0045 1.0066 1.0022 1.0043 0.9936 1.0008 1.0027 0.9966 1.0057 1.0108 1.0027 1.0174 1.0068 1.0033
dispcorr: -0.024762571 hartree
energy: -1465.971704041720
dipole: -6.47547 6.18986 -0.28560 -1.83918 -0.01095 -1.85013 -20.34030 16.76978 -3.57052
magnitude: 4.03152 au
magnitude: 10.24732 debye
