program: Orca
programVersion: 5.0.2
elementType: S O O O N N N N C C C C C C C C C C C C C C C C H H H H H H H H H H H H H H H H H H H H H H
charge: 0
multiplicity: 1
keywords: wb97x-d3
keywords: def2-TZVPP
keywords: def2/J RIJCOSX
keywords: DEFGRID2
keywords: scfconv7
keywords: smallprint printgap noloewdin
keywords: NOSOSCF
formula: C16H22N4O3S
InChI: InChI=1/C16H22N4O3S/c1-6-19(7-2)16(21)20-10-17-15(18-20)24(22,23)14-12(4)8-11(3)9-13(14)5/h8-10H,6-7H2,1-5H3
46 atoms
S  1.376039 2.044516 0.378689
O  2.040835 2.543105 1.572771
O  1.21343 2.968612 -0.733479
O  -3.925941 -0.464015 1.596417
N  -2.964119 -1.328916 -0.26425
N  -2.040992 0.535654 0.885744
N  -0.809532 0.476707 0.377128
N  -1.048455 2.320514 1.632021
C  2.090858 0.505584 -0.144925
C  2.278296 0.22579 -1.509001
C  2.414761 -0.432099 0.857233
C  3.171351 -1.955009 -0.880942
C  2.830476 -1.01068 -1.835443
C  2.947155 -1.6479 0.455667
C  -0.267233 1.557985 0.848339
C  1.925402 1.123198 -2.66401
C  2.217484 -0.229244 2.334539
C  -3.96901 -2.393352 -0.30795
C  -2.096294 -1.249783 -1.441865
C  -3.052504 -0.47337 0.751998
C  3.760156 -3.274379 -1.269188
C  -2.164731 1.645519 1.646082
C  -5.257939 -1.96271 -0.984879
C  -0.900446 -2.179263 -1.360269
H  2.987065 -1.242454 -2.882273
H  3.193055 -2.381066 1.21517
H  -3.522891 -3.227473 -0.849818
H  -4.163227 -2.751119 0.702095
H  -2.717607 -1.522633 -2.297097
H  -1.784878 -0.224687 -1.618326
H  2.134806 0.599895 -3.595142
H  0.870924 1.393948 -2.674305
H  2.504728 2.044179 -2.671447
H  2.360815 -1.178061 2.847696
H  2.934729 0.476889 2.748296
H  1.221048 0.123405 2.59822
H  3.739276 -3.423411 -2.347642
H  4.79949 -3.346816 -0.942847
H  3.221816 -4.099923 -0.801936
H  -3.067066 1.912021 2.172282
H  -5.755404 -1.162812 -0.437235
H  -5.079236 -1.619646 -2.005146
H  -5.945311 -2.80772 -1.037729
H  -0.258629 -1.9333 -0.516211
H  -1.209589 -3.221035 -1.261744
H  -0.309968 -2.098851 -2.273487
elementType: S O N C H
totalener: -1465.94701145 hartree
nucrepener: 2422.66764905 hartree
electener: -3888.61466049 hartree
oneelecener: -6818.97328445 hartree
twoeener: 2930.35862396 hartree
cpcmener: -0.03866496 hartree
kineticenergy: 1460.50602033 hartree
xcener: -121.658280133906 hartree
chargesum: 0.0000000
charge: 0.858772 -0.522902 -0.522169 -0.499532 -0.131593 0.107289 -0.292264 -0.355596 -0.238936 0.157146 0.120248 0.077827 -0.254151 -0.220668 0.101851 -0.203830 -0.228829 -0.030224 -0.018579 0.408566 -0.205372 0.119970 -0.252994 -0.281716 0.118428 0.120352 0.099992 0.093091 0.111812 0.106077 0.090312 0.101792 0.111884 0.094321 0.117043 0.116352 0.093627 0.109505 0.103898 0.177894 0.085946 0.083516 0.097975 0.078914 0.098065 0.096889
qa: 0.8588 -0.5229 -0.5222 -0.4995 -0.1316 0.1073 -0.2923 -0.3556 -0.2389 0.1571 0.1202 0.0778 -0.2542 -0.2207 0.1019 -0.2038 -0.2288 -0.0302 -0.0186 0.4086 -0.2054 0.1200 -0.2530 -0.2817 0.1184 0.1204 0.1000 0.0931 0.1118 0.1061 0.0903 0.1018 0.1119 0.0943 0.1170 0.1164 0.0936 0.1095 0.1039 0.1779 0.0859 0.0835 0.0980 0.0789 0.0981 0.0969
va: 5.6020 1.9527 1.9595 2.0141 3.2448 3.3869 2.8706 3.0920 3.6835 3.5624 3.6383 3.6756 3.9403 3.9810 4.0666 3.8593 3.8810 3.8716 3.8355 4.2402 3.8953 4.0393 3.9157 3.9027 1.0141 1.0109 0.9979 1.0127 0.9956 1.0108 1.0043 1.0056 1.0055 1.0041 1.0015 0.9944 1.0060 0.9951 0.9974 1.0003 1.0118 1.0050 1.0055 1.0102 1.0103 1.0030
dispcorr: -0.026346994 hartree
energy: -1465.973358439136
dipole: -3.96490 3.23113 -0.73376 -28.02453 23.84288 -4.18165 -15.24566 13.12586 -2.11981
magnitude: 4.74533 au
magnitude: 12.06167 debye
