program: Orca
programVersion: 5.0.2
elementType: S O O O N N N N C C C C C C C C C C C C C C C C H H H H H H H H H H H H H H H H H H H H H H
charge: 0
multiplicity: 1
keywords: wb97x-d3
keywords: def2-TZVPP
keywords: def2/J RIJCOSX
keywords: DEFGRID2
keywords: scfconv7
keywords: smallprint printgap noloewdin
keywords: NOSOSCF
formula: C16H22N4O3S
InChI: InChI=1/C16H22N4O3S/c1-6-19(7-2)16(21)20-10-17-15(18-20)24(22,23)14-12(4)8-11(3)9-13(14)5/h8-10H,6-7H2,1-5H3
46 atoms
S  1.412558 2.028621 0.44594
O  2.029789 2.476061 1.685949
O  1.336943 2.995933 -0.638459
O  -3.86409 -0.507075 1.622035
N  -2.94452 -1.305578 -0.291852
N  -2.035547 0.559466 0.848724
N  -0.781179 0.463588 0.406136
N  -1.078998 2.393105 1.512899
C  2.108952 0.482308 -0.089696
C  2.247872 0.195827 -1.458748
C  2.459986 -0.457361 0.901998
C  3.185619 -1.973351 -0.857351
C  2.799344 -1.036659 -1.801886
C  2.995216 -1.666946 0.484475
C  -0.261565 1.577883 0.825977
C  1.83123 1.079247 -2.602807
C  2.276682 -0.273003 2.383709
C  -3.898252 -2.415517 -0.313237
C  -2.173024 -1.121508 -1.522093
C  -3.02553 -0.474255 0.744578
C  3.776854 -3.288055 -1.258835
C  -2.19536 1.717742 1.521153
C  -5.24787 -2.031055 -0.890995
C  -0.95421 -2.019464 -1.60636
H  2.917441 -1.271524 -2.853111
H  3.266321 -2.398717 1.236722
H  -3.448748 -3.20843 -0.911057
H  -4.008799 -2.814873 0.693939
H  -2.852405 -1.345548 -2.347123
H  -1.897999 -0.077479 -1.644469
H  0.78964 1.388791 -2.537701
H  2.439928 1.97812 -2.678539
H  1.947916 0.528703 -3.534455
H  1.271732 0.050275 2.655592
H  2.449325 -1.223998 2.884426
H  2.978398 0.447182 2.799837
H  4.813553 -3.366459 -0.925893
H  3.234308 -4.118808 -0.805329
H  3.762533 -3.425092 -2.339019
H  -3.124138 2.01756 1.979414
H  -5.891047 -2.910436 -0.937216
H  -5.751618 -1.281834 -0.281413
H  -5.153118 -1.640183 -1.905254
H  -1.225615 -3.073864 -1.532679
H  -0.463263 -1.87784 -2.569761
H  -0.236233 -1.795251 -0.819885
elementType: S O N C H
totalener: -1465.94734961 hartree
nucrepener: 2421.74783772 hartree
electener: -3887.69518733 hartree
oneelecener: -6817.12746109 hartree
twoeener: 2929.43227375 hartree
cpcmener: -0.03950714 hartree
kineticenergy: 1460.50282174 hartree
xcener: -121.656630439708 hartree
chargesum: -0.0000000
charge: 0.856797 -0.523246 -0.522055 -0.492392 -0.131090 0.100943 -0.291485 -0.360775 -0.242401 0.147727 0.137399 0.083953 -0.257004 -0.221919 0.113358 -0.210369 -0.223332 -0.030901 -0.028592 0.402869 -0.205336 0.119661 -0.253224 -0.264154 0.118789 0.120831 0.101029 0.093550 0.111020 0.104614 0.100452 0.115221 0.091389 0.112670 0.093302 0.114669 0.108969 0.104563 0.093249 0.179103 0.098016 0.085964 0.083261 0.097486 0.095790 0.071629
qa: 0.8568 -0.5232 -0.5221 -0.4924 -0.1311 0.1009 -0.2915 -0.3608 -0.2424 0.1477 0.1374 0.0840 -0.2570 -0.2219 0.1134 -0.2104 -0.2233 -0.0309 -0.0286 0.4029 -0.2053 0.1197 -0.2532 -0.2642 0.1188 0.1208 0.1010 0.0936 0.1110 0.1046 0.1005 0.1152 0.0914 0.1127 0.0933 0.1147 0.1090 0.1046 0.0932 0.1791 0.0980 0.0860 0.0833 0.0975 0.0958 0.0716
va: 5.6047 1.9530 1.9598 2.0215 3.2304 3.3780 2.8539 3.0980 3.7078 3.5617 3.6281 3.6812 3.9482 3.9845 4.0495 3.8581 3.8787 3.8741 3.8553 4.2473 3.8954 4.0390 3.9128 3.8960 1.0143 1.0110 0.9982 1.0116 0.9970 1.0087 1.0060 1.0049 1.0039 0.9958 1.0041 1.0022 0.9952 0.9970 1.0063 0.9978 1.0054 1.0127 1.0050 1.0100 1.0044 1.0126
dispcorr: -0.026364097 hartree
energy: -1465.973713711160
dipole: -4.50958 3.59526 -0.91432 -27.79879 23.70579 -4.09300 -15.83035 13.52315 -2.30720
magnitude: 4.78663 au
magnitude: 12.16664 debye
