program: Orca
programVersion: 5.0.2
elementType: S O O O N N N N C C C C C C C C C C C C C C C C H H H H H H H H H H H H H H H H H H H H H H
charge: 0
multiplicity: 1
keywords: wb97x-d3
keywords: def2-TZVPP
keywords: def2/J RIJCOSX
keywords: DEFGRID2
keywords: scfconv7
keywords: smallprint printgap noloewdin
keywords: NOSOSCF
formula: C16H22N4O3S
InChI: InChI=1/C16H22N4O3S/c1-6-19(7-2)16(21)20-10-17-15(18-20)24(22,23)14-12(4)8-11(3)9-13(14)5/h8-10H,6-7H2,1-5H3
46 atoms
S  1.103064 1.184661 -1.149743
O  0.769626 2.363937 -0.377696
O  1.424828 1.316184 -2.554322
O  -4.213391 -1.510797 -0.653107
N  -3.779708 -0.149735 1.111424
N  -2.124144 -0.684606 -0.4982
N  -1.323482 0.364036 -0.288376
N  -0.376982 -1.068007 -1.732879
C  2.355238 0.226054 -0.305507
C  3.197636 -0.627782 -1.043079
C  2.462749 0.333016 1.092539
C  4.357523 -1.192159 1.023758
C  4.187466 -1.31064 -0.346773
C  3.476369 -0.382639 1.720564
C  -0.298408 0.089384 -1.043616
C  3.105581 -0.895964 -2.521681
C  1.559704 1.143259 1.98613
C  -5.187722 -0.167051 1.497332
C  -2.857866 0.381597 2.11341
C  -3.465314 -0.816504 -0.008158
C  5.464006 -1.921236 1.723545
C  -1.543293 -1.528385 -1.38304
C  -5.585904 -1.405515 2.284304
C  -2.742488 1.894989 2.098866
H  4.845479 -1.967919 -0.903424
H  3.572347 -0.303453 2.797084
H  -5.363387 0.731285 2.091251
H  -5.802315 -0.075119 0.603372
H  -3.231468 0.045405 3.084325
H  -1.877397 -0.073807 2.000445
H  3.406534 -0.036298 -3.115307
H  3.767283 -1.723513 -2.772235
H  2.099184 -1.17079 -2.829767
H  1.745068 0.866089 3.022722
H  1.739127 2.211179 1.886723
H  0.501972 0.981058 1.785123
H  6.423735 -1.435539 1.539663
H  5.311987 -1.947229 2.801498
H  5.550252 -2.949228 1.371637
H  -2.007865 -2.438588 -1.725004
H  -5.485752 -2.303999 1.678454
H  -4.980361 -1.525364 3.183674
H  -6.626401 -1.32755 2.599451
H  -2.114963 2.223351 2.927827
H  -2.289248 2.2434 1.174485
H  -3.714787 2.374708 2.216386
totalener: -1465.91936576 hartree
nucrepener: 2367.37569271 hartree
electener: -3833.29505846 hartree
oneelecener: -6708.30674518 hartree
twoeener: 2875.01168672 hartree
kineticenergy: 1460.51946839 hartree
xcener: -121.652691372687 hartree
chargesum: -0.0000000
charge: 0.843585 -0.465024 -0.464158 -0.401707 -0.136897 0.097447 -0.298164 -0.333133 -0.310010 0.172303 0.149563 0.067804 -0.202358 -0.199127 0.131250 -0.204264 -0.175758 -0.045679 -0.073424 0.366817 -0.213834 0.082997 -0.242400 -0.240214 0.091443 0.089262 0.090635 0.097731 0.099727 0.095962 0.111308 0.070010 0.114978 0.077251 0.120477 0.056146 0.105651 0.082576 0.094165 0.164880 0.100375 0.068229 0.090351 0.081400 0.117380 0.074449
qa: 0.8436 -0.4650 -0.4642 -0.4017 -0.1369 0.0974 -0.2982 -0.3331 -0.3100 0.1723 0.1496 0.0678 -0.2024 -0.1991 0.1312 -0.2043 -0.1758 -0.0457 -0.0734 0.3668 -0.2138 0.0830 -0.2424 -0.2402 0.0914 0.0893 0.0906 0.0977 0.0997 0.0960 0.1113 0.0700 0.1150 0.0773 0.1205 0.0561 0.1057 0.0826 0.0942 0.1649 0.1004 0.0682 0.0904 0.0814 0.1174 0.0744
va: 5.6419 2.0246 2.0304 2.1057 3.1857 3.3161 2.8731 3.0816 3.7577 3.6802 3.7094 3.7638 4.0125 4.0204 4.0262 3.8788 3.9154 3.8994 3.8923 4.2670 3.9065 4.0622 3.9076 3.8840 1.0166 1.0179 0.9974 1.0117 0.9969 1.0017 1.0041 1.0032 1.0171 1.0054 1.0036 1.0019 0.9936 1.0079 1.0005 1.0026 1.0126 1.0077 1.0091 1.0092 1.0188 1.0109
dispcorr: -0.024363376 hartree
energy: -1465.943729132729
dipole: -3.99454 3.77000 -0.22454 -5.32850 4.07095 -1.25756 22.73133 -20.46432 2.26701
magnitude: 2.60215 au
magnitude: 6.61413 debye
