program: Orca
programVersion: 5.0.2
elementType: S O O O N N N N C C C C C C C C C C C C C C C C H H H H H H H H H H H H H H H H H H H H H H
charge: 0
multiplicity: 1
keywords: wb97x-d3
keywords: def2-TZVPP
keywords: def2/J RIJCOSX
keywords: DEFGRID2
keywords: scfconv7
keywords: smallprint printgap noloewdin
keywords: NOSOSCF
formula: C16H22N4O3S
InChI: InChI=1/C16H22N4O3S/c1-6-19(7-2)16(21)20-10-17-15(18-20)24(22,23)14-12(4)8-11(3)9-13(14)5/h8-10H,6-7H2,1-5H3
46 atoms
S  1.273284 1.789376 0.296544
O  1.902075 2.508529 1.382115
O  0.820886 2.504551 -0.879433
O  -3.64165 -1.373246 1.709953
N  -3.599949 -0.814107 -0.482731
N  -1.975254 -0.008707 1.070045
N  -1.067251 0.439827 0.198597
N  -0.436794 0.918187 2.297116
C  2.290493 0.398865 -0.175999
C  2.358943 -0.00878 -1.519335
C  3.023466 -0.258521 0.83037
C  3.979616 -1.709072 -0.871842
C  3.216832 -1.059579 -1.827457
C  3.854131 -1.30305 0.44758
C  -0.175582 0.988897 0.976684
C  1.581096 0.575951 -2.668917
C  2.982679 0.071512 2.299298
C  -4.716309 -1.722475 -0.737757
C  -3.237853 0.062598 -1.593656
C  -3.147313 -0.78466 0.777782
C  4.924855 -2.808449 -1.250486
C  -1.572662 0.282361 2.330131
C  -6.073021 -1.106583 -0.436483
C  -2.305244 -0.599235 -2.591287
H  3.284128 -1.379748 -2.860424
H  4.423289 -1.815205 1.214623
H  -4.657087 -2.010962 -1.788454
H  -4.57783 -2.631967 -0.155783
H  -4.173187 0.342537 -2.084604
H  -2.801443 0.985377 -1.225053
H  1.738329 -0.039891 -3.552449
H  0.512327 0.613135 -2.475034
H  1.897242 1.588567 -2.906671
H  3.45738 -0.733193 2.858312
H  3.519154 0.992843 2.516269
H  1.975899 0.193045 2.69334
H  4.672389 -3.24265 -2.216651
H  5.946474 -2.430269 -1.319024
H  4.925295 -3.609274 -0.511528
H  -2.135003 0.012812 3.208658
H  -6.169381 -0.867935 0.621036
H  -6.240869 -0.196063 -1.013276
H  -6.866235 -1.808382 -0.694741
H  -2.742131 -1.503219 -3.017652
H  -2.09609 0.084392 -3.413957
H  -1.360492 -0.862796 -2.121262
totalener: -1465.91794416 hartree
nucrepener: 2374.39483532 hartree
electener: -3840.31277947 hartree
oneelecener: -6722.35447324 hartree
twoeener: 2882.04169377 hartree
kineticenergy: 1460.52130188 hartree
xcener: -121.653914772351 hartree
chargesum: -0.0000000
charge: 0.844223 -0.454702 -0.473219 -0.411919 -0.144061 0.090952 -0.306705 -0.310489 -0.300723 0.153456 0.146341 0.069630 -0.196452 -0.202509 0.112201 -0.191619 -0.223390 -0.045013 -0.049999 0.377651 -0.212344 0.091919 -0.240131 -0.265436 0.089469 0.091870 0.089764 0.096468 0.100237 0.113369 0.076854 0.083487 0.118309 0.074128 0.116991 0.116612 0.084852 0.105495 0.091760 0.167396 0.099757 0.069794 0.089183 0.083632 0.094838 0.088072
qa: 0.8442 -0.4547 -0.4732 -0.4119 -0.1441 0.0910 -0.3067 -0.3105 -0.3007 0.1535 0.1463 0.0696 -0.1965 -0.2025 0.1122 -0.1916 -0.2234 -0.0450 -0.0500 0.3777 -0.2123 0.0919 -0.2401 -0.2654 0.0895 0.0919 0.0898 0.0965 0.1002 0.1134 0.0769 0.0835 0.1183 0.0741 0.1170 0.1166 0.0849 0.1055 0.0918 0.1674 0.0998 0.0698 0.0892 0.0836 0.0948 0.0881
va: 5.6412 2.0411 2.0208 2.0944 3.2062 3.3650 2.9352 3.0449 3.7478 3.6687 3.7139 3.7605 4.0170 4.0198 4.0545 3.8916 3.8983 3.8922 3.8400 4.2513 3.9066 4.0282 3.9146 3.9019 1.0175 1.0170 0.9953 1.0140 0.9955 1.0157 1.0020 1.0058 1.0074 1.0034 1.0011 1.0137 1.0067 0.9932 1.0018 1.0028 1.0117 1.0080 1.0088 1.0122 1.0065 1.0103
dispcorr: -0.024257438 hartree
energy: -1465.942201596114
dipole: -7.29166 6.48974 -0.80192 -16.99080 15.07483 -1.91597 -16.92766 15.61976 -1.30791
magnitude: 2.45451 au
magnitude: 6.23888 debye
