program: Orca
programVersion: 5.0.2
elementType: S O O O N N N N C C C C C C C C C C C C C C C C H H H H H H H H H H H H H H H H H H H H H H
charge: 0
multiplicity: 1
keywords: wb97x-d3
keywords: def2-TZVPP
keywords: def2/J RIJCOSX
keywords: DEFGRID2
keywords: scfconv7
keywords: smallprint printgap noloewdin
keywords: NOSOSCF
formula: C16H22N4O3S
InChI: InChI=1/C16H22N4O3S/c1-6-19(7-2)16(21)20-10-17-15(18-20)24(22,23)14-12(4)8-11(3)9-13(14)5/h8-10H,6-7H2,1-5H3
46 atoms
S  1.162165 1.264344 -0.968972
O  0.869548 2.37952 -0.092566
O  1.413256 1.508158 -2.372874
O  -3.647128 -2.120362 0.254515
N  -3.820641 -0.033916 1.126076
N  -2.03778 -0.657109 -0.319351
N  -1.195588 0.335747 -0.019234
N  -0.399221 -0.873997 -1.732211
C  2.452503 0.243234 -0.272026
C  3.270649 -0.52476 -1.121054
C  2.613376 0.212941 1.125943
C  4.515695 -1.275313 0.834432
C  4.29369 -1.259928 -0.532723
C  3.654626 -0.548895 1.641364
C  -0.24302 0.170484 -0.89316
C  3.12413 -0.652662 -2.614177
C  1.730745 0.913978 2.124902
C  -4.98368 -0.446241 1.907604
C  -3.569565 1.406518 1.097575
C  -3.243214 -0.989074 0.383925
C  5.657067 -2.049576 1.420737
C  -1.532865 -1.383097 -1.345109
C  -6.282144 -0.393684 1.118438
C  -2.774888 1.900001 2.292379
H  4.93418 -1.851657 -1.176124
H  3.788436 -0.577566 2.716409
H  -4.817676 -1.449963 2.294237
H  -5.038744 0.218427 2.771011
H  -3.075088 1.691136 0.174037
H  -4.550182 1.888803 1.076812
H  3.40248 0.260669 -3.134242
H  3.777431 -1.449635 -2.965388
H  2.107934 -0.901275 -2.911556
H  1.978742 0.564637 3.125405
H  1.861108 1.992538 2.10262
H  0.672309 0.71625 1.962722
H  6.558806 -1.435408 1.458415
H  5.443414 -2.3753 2.438005
H  5.891303 -2.932627 0.827337
H  -2.027284 -2.24661 -1.758434
H  -7.122161 -0.651652 1.763213
H  -6.471883 0.602971 0.717841
H  -6.265711 -1.09989 0.290417
H  -2.697625 2.986382 2.261281
H  -3.252442 1.630163 3.235106
H  -1.766705 1.493247 2.282111
totalener: -1465.92006786 hartree
nucrepener: 2359.17263411 hartree
electener: -3825.09270197 hartree
oneelecener: -6692.07122179 hartree
twoeener: 2866.97851982 hartree
kineticenergy: 1460.52168112 hartree
xcener: -121.653716022508 hartree
chargesum: 0.0000000
charge: 0.839470 -0.465197 -0.464741 -0.408525 -0.143822 0.102037 -0.323449 -0.328439 -0.313019 0.162402 0.166007 0.070196 -0.196005 -0.199702 0.140173 -0.200653 -0.211561 -0.045903 -0.051193 0.368880 -0.211789 0.083211 -0.241120 -0.236418 0.089315 0.089578 0.097016 0.090193 0.104709 0.097802 0.110540 0.070283 0.112026 0.076765 0.119188 0.089305 0.104942 0.087167 0.088900 0.165942 0.089216 0.070094 0.099146 0.087923 0.069978 0.099132
qa: 0.8395 -0.4652 -0.4647 -0.4085 -0.1438 0.1020 -0.3234 -0.3284 -0.3130 0.1624 0.1660 0.0702 -0.1960 -0.1997 0.1402 -0.2007 -0.2116 -0.0459 -0.0512 0.3689 -0.2118 0.0832 -0.2411 -0.2364 0.0893 0.0896 0.0970 0.0902 0.1047 0.0978 0.1105 0.0703 0.1120 0.0768 0.1192 0.0893 0.1049 0.0872 0.0889 0.1659 0.0892 0.0701 0.0991 0.0879 0.0700 0.0991
va: 5.6454 2.0231 2.0333 2.0987 3.2054 3.3168 2.8607 3.0857 3.7728 3.6926 3.6924 3.7594 4.0124 4.0263 4.0213 3.8795 3.9130 3.8958 3.8622 4.2639 3.9071 4.0597 3.9122 3.9301 1.0174 1.0178 1.0136 0.9959 1.0166 0.9944 1.0042 1.0034 1.0167 1.0080 1.0009 0.9959 0.9929 1.0048 1.0041 1.0031 1.0090 1.0081 1.0116 1.0114 1.0084 1.0003
dispcorr: -0.023857974 hartree
energy: -1465.943925832397
dipole: -6.85956 6.20480 -0.65476 -2.31882 1.57747 -0.74135 16.79001 -15.34329 1.44673
magnitude: 1.75252 au
magnitude: 4.45456 debye
