program: Orca
programVersion: 5.0.2
elementType: S O O O N N N N C C C C C C C C C C C C C C C C H H H H H H H H H H H H H H H H H H H H H H
charge: 0
multiplicity: 1
keywords: wb97x-d3
keywords: def2-TZVPP
keywords: def2/J RIJCOSX
keywords: DEFGRID2
keywords: scfconv7
keywords: smallprint printgap noloewdin
keywords: NOSOSCF
formula: C16H22N4O3S
InChI: InChI=1/C16H22N4O3S/c1-6-19(7-2)16(21)20-10-17-15(18-20)24(22,23)14-12(4)8-11(3)9-13(14)5/h8-10H,6-7H2,1-5H3
46 atoms
S  1.139362 1.494233 0.05884
O  1.375966 2.427009 1.141778
O  0.709933 1.991268 -1.232515
O  -3.60969 -2.032179 1.046804
N  -4.084862 -0.217826 -0.232268
N  -1.981285 -0.491824 0.821196
N  -1.284661 0.326112 0.029337
N  -0.036816 -0.316753 1.77929
C  2.521748 0.385578 -0.143196
C  3.579117 0.381926 0.781969
C  2.51876 -0.470751 -1.259995
C  4.698131 -1.302454 -0.578587
C  4.652749 -0.46355 0.522154
C  3.616881 -1.299042 -1.44578
C  -0.140378 0.405543 0.64523
C  3.656889 1.199267 2.043176
C  1.413646 -0.570121 -2.277468
C  -5.381209 -0.788592 -0.585912
C  -3.902957 1.189112 -0.590763
C  -3.303274 -0.97393 0.551341
C  5.86318 -2.21779 -0.80349
C  -1.206521 -0.883939 1.860126
C  -6.445794 -0.56015 0.475374
C  -3.447153 1.398121 -2.023204
H  5.482639 -0.465749 1.219016
H  3.624309 -1.961948 -2.303222
H  -5.682513 -0.329782 -1.528899
H  -5.262856 -1.853442 -0.779231
H  -4.871132 1.671977 -0.43473
H  -3.215311 1.672065 0.097263
H  4.533911 0.892487 2.61054
H  3.746272 2.264207 1.842125
H  2.784074 1.060097 2.676305
H  1.39598 0.29445 -2.937226
H  1.568346 -1.458015 -2.887885
H  0.422338 -0.651992 -1.835341
H  6.031817 -2.400231 -1.864071
H  6.781302 -1.810087 -0.382659
H  5.689653 -3.186199 -0.330075
H  -1.544141 -1.563302 2.625457
H  -6.580824 0.50087 0.6898
H  -7.404607 -0.949142 0.132722
H  -6.189905 -1.068855 1.402776
H  -4.135007 0.943889 -2.737444
H  -3.404851 2.464985 -2.24169
H  -2.453352 0.98724 -2.180695
totalener: -1465.91984413 hartree
nucrepener: 2352.22674200 hartree
electener: -3818.14658612 hartree
oneelecener: -6678.24707676 hartree
twoeener: 2860.10049064 hartree
kineticenergy: 1460.53912475 hartree
xcener: -121.656045045350 hartree
chargesum: -0.0000000
charge: 0.846528 -0.473876 -0.465313 -0.404797 -0.142180 0.105623 -0.315476 -0.319363 -0.281969 0.168117 0.132710 0.071926 -0.193836 -0.197178 0.114305 -0.189725 -0.230463 -0.044420 -0.056914 0.364667 -0.215466 0.076660 -0.241673 -0.231220 0.090713 0.091011 0.090533 0.095886 0.096518 0.101550 0.071051 0.107935 0.106549 0.122521 0.078772 0.106540 0.089201 0.088867 0.104757 0.165110 0.069769 0.088733 0.099813 0.066050 0.085760 0.105688
qa: 0.8465 -0.4739 -0.4653 -0.4048 -0.1422 0.1056 -0.3155 -0.3194 -0.2820 0.1681 0.1327 0.0719 -0.1938 -0.1972 0.1143 -0.1897 -0.2305 -0.0444 -0.0569 0.3647 -0.2155 0.0767 -0.2417 -0.2312 0.0907 0.0910 0.0905 0.0959 0.0965 0.1016 0.0711 0.1079 0.1065 0.1225 0.0788 0.1065 0.0892 0.0889 0.1048 0.1651 0.0698 0.0887 0.0998 0.0660 0.0858 0.1057
va: 5.6473 2.0213 2.0230 2.1038 3.1942 3.3026 2.8272 3.0828 3.7493 3.6651 3.7217 3.7544 4.0116 4.0292 4.0361 3.8826 3.9219 3.8985 3.8755 4.2684 3.9064 4.0626 3.9099 3.9151 1.0171 1.0171 0.9956 1.0127 0.9948 1.0144 1.0036 1.0055 1.0125 0.9989 1.0066 0.9953 1.0039 1.0046 0.9926 1.0028 1.0079 1.0092 1.0121 1.0072 1.0110 1.0135
dispcorr: -0.023660072 hartree
energy: -1465.943504197929
dipole: -8.49918 7.86809 -0.63109 -5.61932 4.61156 -1.00776 -9.00240 8.55437 -0.44803
magnitude: 1.27066 au
magnitude: 3.22977 debye
