program: Orca
programVersion: 5.0.2
elementType: S O O O N N N N C C C C C C C C C C C C C C C C H H H H H H H H H H H H H H H H H H H H H H
charge: 0
multiplicity: 1
keywords: wb97x-d3
keywords: def2-TZVPP
keywords: def2/J RIJCOSX
keywords: DEFGRID2
keywords: scfconv7
keywords: smallprint printgap noloewdin
keywords: NOSOSCF
formula: C16H22N4O3S
InChI: InChI=1/C16H22N4O3S/c1-6-19(7-2)16(21)20-10-17-15(18-20)24(22,23)14-12(4)8-11(3)9-13(14)5/h8-10H,6-7H2,1-5H3
46 atoms
S  1.121565 1.23383 -1.078954
O  0.76269 2.381601 -0.271948
O  1.477362 1.420666 -2.469177
O  -3.725458 -2.118579 0.012349
N  -4.022359 0.041896 0.634242
N  -2.122945 -0.661642 -0.603649
N  -1.310248 0.351374 -0.289461
N  -0.367132 -0.955274 -1.850618
C  2.357233 0.251565 -0.240211
C  3.227222 -0.561377 -0.988705
C  2.430587 0.306099 1.165003
C  4.350733 -1.186255 1.080736
C  4.212839 -1.256284 -0.295267
C  3.43956 -0.417149 1.787881
C  -0.284404 0.138147 -1.064241
C  3.175288 -0.773585 -2.478231
C  1.490842 1.064381 2.065492
C  -5.15765 -0.348656 1.470923
C  -3.825638 1.474013 0.416479
C  -3.366151 -0.966021 0.043471
C  5.454519 -1.913319 1.787039
C  -1.530121 -1.446579 -1.533272
C  -4.745381 -0.983838 2.788795
C  -3.193524 2.18394 1.598893
H  4.892625 -1.882357 -0.861066
H  3.507912 -0.379721 2.868964
H  -5.731209 0.557918 1.662564
H  -5.809159 -1.02339 0.913598
H  -3.233134 1.640112 -0.477595
H  -4.812619 1.895161 0.208399
H  3.501316 0.106068 -3.028296
H  3.83831 -1.596379 -2.740849
H  2.177316 -1.026796 -2.828269
H  1.645503 2.138887 2.00504
H  0.442494 0.878857 1.837953
H  1.661801 0.757332 3.095987
H  6.304735 -1.249995 1.957052
H  5.133312 -2.283331 2.760326
H  5.814196 -2.761939 1.206858
H  -1.986126 -2.337661 -1.932473
H  -4.214986 -1.920985 2.632246
H  -4.106326 -0.317322 3.367486
H  -5.63122 -1.202914 3.385256
H  -3.784823 2.062173 2.507381
H  -2.188292 1.810186 1.779881
H  -3.120985 3.251676 1.39344
totalener: -1465.91903716 hartree
nucrepener: 2366.00144603 hartree
electener: -3831.92048319 hartree
oneelecener: -6705.75605442 hartree
twoeener: 2873.83557123 hartree
kineticenergy: 1460.52085413 hartree
xcener: -121.652286282039 hartree
chargesum: 0.0000000
charge: 0.838863 -0.465244 -0.464458 -0.401936 -0.134298 0.098990 -0.317412 -0.331097 -0.308544 0.160749 0.163550 0.069349 -0.193146 -0.201906 0.140615 -0.203294 -0.206448 -0.052983 -0.054588 0.357302 -0.213408 0.084294 -0.240060 -0.244062 0.089877 0.089686 0.083809 0.102604 0.103865 0.090586 0.110537 0.070564 0.113102 0.117345 0.088498 0.076521 0.105172 0.089555 0.087009 0.165117 0.101433 0.076794 0.088697 0.073184 0.104287 0.090933
qa: 0.8389 -0.4652 -0.4645 -0.4019 -0.1343 0.0990 -0.3174 -0.3311 -0.3085 0.1607 0.1635 0.0693 -0.1931 -0.2019 0.1406 -0.2033 -0.2064 -0.0530 -0.0546 0.3573 -0.2134 0.0843 -0.2401 -0.2441 0.0899 0.0897 0.0838 0.1026 0.1039 0.0906 0.1105 0.0706 0.1131 0.1173 0.0885 0.0765 0.1052 0.0896 0.0870 0.1651 0.1014 0.0768 0.0887 0.0732 0.1043 0.0909
va: 5.6452 2.0230 2.0322 2.1062 3.1881 3.3110 2.8556 3.0835 3.7672 3.6980 3.6930 3.7601 4.0124 4.0252 4.0173 3.8789 3.9149 3.8876 3.8622 4.2734 3.9068 4.0609 3.9119 3.9151 1.0173 1.0174 0.9973 1.0105 1.0170 0.9957 1.0038 1.0034 1.0178 1.0006 0.9984 1.0070 0.9929 1.0028 1.0060 1.0028 1.0106 1.0050 1.0088 1.0031 1.0008 1.0133
dispcorr: -0.024042779 hartree
energy: -1465.943079943154
dipole: -5.05479 4.32548 -0.72931 -2.32118 1.65619 -0.66499 20.03019 -18.61551 1.41468
magnitude: 1.72494 au
magnitude: 4.38446 debye
