program: Orca
programVersion: 5.0.2
elementType: S O O O N N N N C C C C C C C C C C C C C C C C H H H H H H H H H H H H H H H H H H H H H H
charge: 0
multiplicity: 1
keywords: wb97x-d3
keywords: def2-TZVPP
keywords: def2/J RIJCOSX
keywords: DEFGRID2
keywords: scfconv7
keywords: smallprint printgap noloewdin
keywords: NOSOSCF
formula: C16H22N4O3S
InChI: InChI=1/C16H22N4O3S/c1-6-19(7-2)16(21)20-10-17-15(18-20)24(22,23)14-12(4)8-11(3)9-13(14)5/h8-10H,6-7H2,1-5H3
46 atoms
S  1.429875 2.040742 0.500823
O  2.087347 2.415982 1.734494
O  1.32638 3.012758 -0.569333
O  -3.893853 -0.496527 1.589584
N  -2.944298 -1.263625 -0.3218
N  -2.036493 0.564489 0.889692
N  -0.796574 0.511207 0.39361
N  -1.031982 2.312583 1.709529
C  2.082069 0.488475 -0.101031
C  2.201099 0.244612 -1.477917
C  2.432405 -0.488614 0.849446
C  3.115256 -1.955576 -0.965239
C  2.731148 -0.981734 -1.870529
C  2.94287 -1.692686 0.385854
C  -0.242121 1.571244 0.908113
C  1.782525 1.177507 -2.582552
C  2.280695 -0.341806 2.339662
C  -3.905644 -2.361654 -0.368958
C  -2.155201 -1.06692 -1.535727
C  -3.038666 -0.447227 0.738052
C  3.704173 -3.255683 -1.422912
C  -2.152756 1.649962 1.691065
C  -5.249074 -1.959365 -0.955304
C  -0.929903 -1.960071 -1.610987
H  2.8356 -1.179787 -2.930873
H  3.212385 -2.452331 1.110593
H  -3.453634 -3.154493 -0.966993
H  -4.037506 -2.763674 0.634203
H  -2.822822 -1.277655 -2.375446
H  -1.869509 -0.023934 -1.637107
H  0.741938 1.483153 -2.495545
H  2.379321 2.085664 -2.609629
H  1.900757 0.671193 -3.539258
H  1.290915 0.001089 2.637743
H  2.442748 -1.308118 2.813921
H  2.998706 0.361853 2.7536
H  4.785832 -3.262531 -1.277296
H  3.298376 -4.097749 -0.862238
H  3.515777 -3.434532 -2.480433
H  -3.056785 1.897853 2.222635
H  -5.741294 -1.215393 -0.332304
H  -5.145264 -1.552897 -1.962295
H  -5.90329 -2.828933 -1.019585
H  -0.429255 -1.821153 -2.569343
H  -0.218532 -1.717783 -0.824902
H  -1.195068 -3.015224 -1.530905
totalener: -1465.91703629 hartree
nucrepener: 2424.98962134 hartree
electener: -3890.90665764 hartree
oneelecener: -6823.17422753 hartree
twoeener: 2932.26756989 hartree
kineticenergy: 1460.53271610 hartree
xcener: -121.655668300773 hartree
chargesum: -0.0000000
charge: 0.851830 -0.453446 -0.466694 -0.404564 -0.142835 0.073591 -0.295060 -0.286003 -0.250750 0.142696 0.143171 0.084414 -0.240053 -0.195411 0.077403 -0.202626 -0.223003 -0.043108 -0.058431 0.369535 -0.211983 0.086325 -0.242397 -0.235860 0.087134 0.091548 0.087861 0.096628 0.099588 0.101338 0.094889 0.121549 0.073287 0.110689 0.076052 0.124420 0.107446 0.092623 0.082804 0.164770 0.100829 0.068982 0.089603 0.081231 0.087391 0.082598
qa: 0.8518 -0.4534 -0.4667 -0.4046 -0.1428 0.0736 -0.2951 -0.2860 -0.2507 0.1427 0.1432 0.0844 -0.2401 -0.1954 0.0774 -0.2026 -0.2230 -0.0431 -0.0584 0.3695 -0.2120 0.0863 -0.2424 -0.2359 0.0871 0.0915 0.0879 0.0966 0.0996 0.1013 0.0949 0.1215 0.0733 0.1107 0.0761 0.1244 0.1074 0.0926 0.0828 0.1648 0.1008 0.0690 0.0896 0.0812 0.0874 0.0826
va: 5.6324 2.0362 2.0257 2.1032 3.1912 3.3631 2.8310 3.0967 3.7689 3.5946 3.6810 3.7175 3.9700 4.0090 4.0681 3.8927 3.9161 3.8960 3.8835 4.2641 3.9069 4.0479 3.9114 3.8884 1.0201 1.0167 0.9971 1.0126 0.9963 1.0127 1.0073 1.0068 1.0021 0.9947 1.0029 1.0013 0.9939 1.0009 1.0075 1.0034 1.0126 1.0076 1.0088 1.0094 1.0142 1.0130
dispcorr: -0.026551613 hartree
energy: -1465.943587907838
dipole: -4.60611 3.93617 -0.66995 -27.31775 24.57334 -2.74442 -16.62726 15.07501 -1.55225
magnitude: 3.22337 au
magnitude: 8.19316 debye
