program: Orca
programVersion: 5.0.2
elementType: S O O O N N N N C C C C C C C C C C C C C C C C H H H H H H H H H H H H H H H H H H H H H H
charge: 0
multiplicity: 1
keywords: wb97x-d3
keywords: def2-TZVPP
keywords: def2/J RIJCOSX
keywords: DEFGRID2
keywords: scfconv7
keywords: smallprint printgap noloewdin
keywords: NOSOSCF
formula: C16H22N4O3S
InChI: InChI=1/C16H22N4O3S/c1-6-19(7-2)16(21)20-10-17-15(18-20)24(22,23)14-12(4)8-11(3)9-13(14)5/h8-10H,6-7H2,1-5H3
46 atoms
S  1.143617 1.298021 -0.902767
O  0.851649 2.403672 -0.01457
O  1.350191 1.553563 -2.311881
O  -3.583402 -2.170851 0.400334
N  -3.825703 -0.050043 1.182628
N  -2.007614 -0.688169 -0.2084
N  -1.197626 0.339112 0.063315
N  -0.351234 -0.906431 -1.600083
C  2.469146 0.297682 -0.24408
C  3.297074 -0.434317 -1.117136
C  2.644896 0.245465 1.150034
C  4.569623 -1.203663 0.813197
C  4.338189 -1.160521 -0.553211
C  3.70654 -0.506544 1.641161
C  -0.232615 0.170378 -0.7955
C  3.14315 -0.527002 -2.611916
C  1.765206 0.917105 2.171545
C  -4.976611 -0.46369 1.981895
C  -3.647431 1.394303 0.993258
C  -3.215621 -1.023508 0.488361
C  5.700687 -2.014725 1.369738
C  -1.473496 -1.433827 -1.205257
C  -6.30211 -0.348911 1.247023
C  -3.981507 1.888494 -0.405048
H  4.988255 -1.722078 -1.214301
H  3.854786 -0.548323 2.713767
H  -4.822233 -1.488177 2.31301
H  -4.985291 0.159333 2.878089
H  -4.323128 1.866025 1.706395
H  -2.641155 1.694198 1.27194
H  3.822716 -1.28894 -2.990186
H  2.133951 -0.806196 -2.90661
H  3.381753 0.409866 -3.109415
H  2.01503 0.536575 3.160572
H  1.90298 1.995691 2.181822
H  0.704868 0.732353 2.008705
H  5.510977 -3.082519 1.247739
H  6.636948 -1.793445 0.856802
H  5.849014 -1.825437 2.43168
H  -1.939947 -2.324928 -1.591737
H  -6.309555 -0.973357 0.354636
H  -7.115616 -0.679657 1.892772
H  -6.517549 0.678405 0.951572
H  -3.90729 2.975449 -0.431487
H  -3.292945 1.508094 -1.157545
H  -4.993987 1.6125 -0.698988
totalener: -1465.91781217 hartree
nucrepener: 2358.05088970 hartree
electener: -3823.96870187 hartree
oneelecener: -6689.86055257 hartree
twoeener: 2865.89185070 hartree
kineticenergy: 1460.52161291 hartree
xcener: -121.653013527899 hartree
chargesum: -0.0000000
charge: 0.839754 -0.465042 -0.466731 -0.402926 -0.146615 0.098483 -0.322108 -0.326813 -0.296457 0.173393 0.140727 0.069608 -0.207813 -0.193997 0.141532 -0.197764 -0.215889 -0.035861 -0.083973 0.363618 -0.214338 0.083661 -0.254047 -0.240127 0.091738 0.090125 0.096978 0.084836 0.089983 0.133022 0.069832 0.111202 0.109992 0.075256 0.117491 0.103667 0.102831 0.098258 0.081984 0.166078 0.101277 0.092811 0.075090 0.095856 0.088689 0.082728
qa: 0.8398 -0.4650 -0.4667 -0.4029 -0.1466 0.0985 -0.3221 -0.3268 -0.2965 0.1734 0.1407 0.0696 -0.2078 -0.1940 0.1415 -0.1978 -0.2159 -0.0359 -0.0840 0.3636 -0.2143 0.0837 -0.2540 -0.2401 0.0917 0.0901 0.0970 0.0848 0.0900 0.1330 0.0698 0.1112 0.1100 0.0753 0.1175 0.1037 0.1028 0.0983 0.0820 0.1661 0.1013 0.0928 0.0751 0.0959 0.0887 0.0827
va: 5.6472 2.0245 2.0306 2.1030 3.1922 3.2976 2.8105 3.0884 3.7629 3.6754 3.7355 3.7609 4.0132 4.0148 3.9897 3.8781 3.9121 3.8765 3.8752 4.2722 3.9061 4.0580 3.9086 3.9319 1.0166 1.0179 1.0178 0.9989 0.9898 1.0085 1.0032 1.0164 1.0045 1.0049 1.0005 1.0015 0.9943 0.9986 1.0090 1.0032 1.0066 1.0117 1.0029 1.0125 1.0107 1.0023
dispcorr: -0.023970782 hartree
energy: -1465.941782956221
dipole: -9.21233 8.48199 -0.73033 -2.18004 1.43011 -0.74992 10.92530 -9.62544 1.29987
magnitude: 1.66896 au
magnitude: 4.24216 debye
