program: Orca
programVersion: 5.0.2
elementType: Cl O O N C C C C C C C C C C C C C C C C C H H H H H H H H H H H H H H H H H H H H H H H H H H
charge: 0
multiplicity: 1
keywords: wb97x-d3
keywords: def2-TZVPP
keywords: def2/J RIJCOSX
keywords: DEFGRID2
keywords: scfconv7
keywords: smallprint printgap noloewdin
keywords: NOSOSCF
formula: C17H26ClNO2
InChI: InChI=1/C17H26ClNO2/c1-4-7-11-21-13-19(16(20)12-18)17-14(5-2)9-8-10-15(17)6-3/h8-10H,4-7,11-13H2,1-3H3
47 atoms
Cl -2.141614 2.76008 0.455477
O  1.914154 0.320198 -0.09684
O  0.540484 1.630821 2.199816
N  -0.199417 0.004977 0.820935
C  -1.278626 -0.666177 0.165893
C  -1.993474 -1.639947 0.877385
C  -1.584673 -0.360376 -1.163542
C  -1.652191 -2.02942 2.290436
C  -0.79728 0.616719 -1.991875
C  1.136389 -0.529282 0.701895
C  -3.043524 -2.288739 0.237346
C  -2.644642 -1.035279 -1.766062
C  3.992455 0.735331 -1.200372
C  3.261196 -0.10606 -0.177095
C  -3.371844 -1.987568 -1.0749
C  -0.384445 1.081858 1.623147
C  5.470628 0.374661 -1.271487
C  -0.686219 -3.21083 2.345134
C  0.141703 -0.097697 -2.962407
C  -1.797419 1.607853 1.783434
C  6.208743 1.152625 -2.349309
H  -2.573819 -2.304097 2.806392
H  -1.231367 -1.191493 2.847579
H  -0.228268 1.29809 -1.363408
H  -1.493501 1.235885 -2.560949
H  1.059681 -1.524719 0.254603
H  1.58214 -0.641573 1.697945
H  -3.611744 -3.034931 0.779734
H  -2.899918 -0.801881 -2.792974
H  3.887357 1.79484 -0.948269
H  3.530195 0.593925 -2.18259
H  3.310865 -1.165345 -0.463204
H  3.743339 -0.018017 0.806303
H  -4.197159 -2.495233 -1.557069
H  5.936397 0.562496 -0.299903
H  5.577686 -0.697856 -1.458366
H  -1.104845 -4.082369 1.840548
H  -0.480211 -3.490459 3.378619
H  0.267026 -2.979943 1.869231
H  0.727671 0.623197 -3.533549
H  -0.415956 -0.709434 -3.672554
H  0.83758 -0.754975 -2.440221
H  -2.564506 0.839547 1.76316
H  -1.863187 2.154751 2.720095
H  6.131971 2.229056 -2.185716
H  5.800814 0.940807 -3.339259
H  7.268886 0.897995 -2.368943
elementType: Cl O N C H
totalener: -1328.98916945 hartree
nucrepener: 1943.84331935 hartree
electener: -3272.83248880 hartree
oneelecener: -5679.53620426 hartree
twoeener: 2406.70371547 hartree
cpcmener: -0.03560314 hartree
kineticenergy: 1324.27512431 hartree
xcener: -107.422018243825 hartree
chargesum: 0.0000000
charge: -0.153371 -0.377388 -0.517417 0.012585 0.084860 -0.121335 -0.152707 -0.142884 -0.144947 0.075331 -0.064759 -0.086083 -0.095914 0.010371 -0.188873 0.303855 -0.085764 -0.271549 -0.294406 -0.055230 -0.285535 0.088981 0.084155 0.060108 0.091993 0.133699 0.128535 0.143217 0.143956 0.064559 0.062473 0.082386 0.086935 0.158627 0.061694 0.058941 0.089234 0.097061 0.087788 0.101078 0.096878 0.082125 0.145768 0.151057 0.079477 0.080095 0.090341
qa: -0.1534 -0.3774 -0.5174 0.0126 0.0849 -0.1213 -0.1527 -0.1429 -0.1449 0.0753 -0.0648 -0.0861 -0.0959 0.0104 -0.1889 0.3039 -0.0858 -0.2715 -0.2944 -0.0552 -0.2855 0.0890 0.0842 0.0601 0.0920 0.1337 0.1285 0.1432 0.1440 0.0646 0.0625 0.0824 0.0869 0.1586 0.0617 0.0589 0.0892 0.0971 0.0878 0.1011 0.0969 0.0821 0.1458 0.1511 0.0795 0.0801 0.0903
va: 1.1200 1.9169 1.9800 2.9481 3.6260 3.8121 3.7808 3.8785 3.8357 3.8999 3.7902 3.8063 3.9071 3.8987 3.9593 4.1146 3.8894 3.9126 3.9326 3.9617 3.9502 1.0030 1.0097 1.0420 1.0039 0.9839 0.9942 0.9974 0.9973 1.0136 1.0092 0.9897 0.9978 0.9901 1.0077 1.0068 1.0022 1.0041 1.0045 1.0006 1.0069 1.0028 1.0094 1.0086 0.9998 1.0006 1.0036
dispcorr: -0.025831986 hartree
energy: -1329.015001432086
dipole: 28.27500 -28.84872 -0.57373 -16.76825 14.23794 -2.53031 -10.59997 10.38502 -0.21495
magnitude: 2.60343 au
magnitude: 6.61738 debye
