program: Gaussian 09
title: 000055880
version: EM64L-G09RevD.01
frameworkgroup: C1[X(C20H23NO)]
method: RPBEPBE
basis: SDD
operation: Freq
keyword: #p
keyword: freq=noraman
keyword: PBEPBE/SDD
title: #p freq=noraman PBEPBE/SDD
converged: YES YES NO NO
title: Mulliken charges:
elementType: O N C C C C C C C C C C C C C C C C C C C C H H H H H H H H H H H H H H H H H H H H H H H
charge: -0.436754 -0.101766 -0.130296 -0.303630 -0.457760 -0.480284 0.313871 0.320814 -0.404715 -0.353594 0.515406 -0.406299 -0.584118 -0.643681 -0.473122 -0.352788 0.310735 -0.425961 -0.400513 -0.407424 0.435359 -0.811377 0.229191 0.226495 0.229018 0.196488 0.219500 0.246513 0.195761 0.206690 0.166820 0.249966 0.271969 0.218415 0.255119 0.180915 0.226801 0.261471 0.216290 0.224011 0.226255 0.351425 0.222676 0.232003 0.224104
chargesum: 0.00000
title: Mulliken charges with hydrogens summed into heavy atoms:
elementType: O N C C C C C C C C C C C C C C C C C C C C
charge: -0.085329 -0.101766 0.098895 -0.077135 -0.228741 -0.064296 0.313871 0.320814 0.037559 0.019916 0.515406 -0.156333 -0.312149 0.010769 -0.246321 -0.091317 0.310735 -0.209670 -0.176502 -0.181169 0.435359 -0.132594
polarizability: 2.66764325e+02 -1.98193526e+00 2.14174911e+02 -1.22100099e+01 1.38364553e+00 1.79708855e+02
1716.lowfreq: -23.8622 -9.7201 -7.9829 -0.0004 0.0003 0.0007 4.1674 29.3721 47.1788
frequency: -23.6185 29.0633 47.1385 49.4290 76.1245 86.6575 125.3347 150.9700 174.4244 190.8970 205.9053 235.0821 253.1573 288.1536 299.3267 314.1627 342.2985 349.9848 353.8726 358.0466 392.5432 406.8600 419.3166 442.6540 464.9319 468.4524 487.3295 515.1198 548.5132 564.0212 596.4566 634.5149 655.2313 662.1100 707.8497 722.2132 761.7244 784.0624 792.3896 794.5914 814.8087 835.3419 842.1470 849.5052 856.6906 871.5858 883.5413 892.1366 933.0598 940.8499 951.9840 959.2602 973.0408 985.7650 993.9197 1015.5882 1031.5184 1040.0156 1046.2892 1081.6098 1102.0801 1117.9388 1123.3119 1125.4455 1127.9465 1139.2805 1163.5474 1169.9383 1177.3090 1195.3005 1195.9928 1209.0445 1222.1916 1223.8278 1239.7519 1255.5119 1264.6197 1274.9056 1279.3974 1289.9492 1313.8481 1321.5528 1325.0268 1336.8356 1344.1569 1361.4688 1364.2000 1379.8091 1395.9478 1397.2035 1410.9241 1430.3644 1452.0020 1459.2254 1461.4890 1466.6378 1472.4062 1472.5524 1473.2789 1485.6218 1488.3162 1507.2446 1580.8473 1595.3552 1622.4628 1629.5038 2809.2011 2820.3327 2845.2602 2958.7373 2971.8916 2973.0274 2989.4880 2998.5333 3021.3039 3025.0358 3029.4181 3052.5764 3077.8003 3081.6136 3087.5403 3101.2728 3109.9029 3115.2738 3128.7296 3137.4355 3154.8658 3157.0086 3582.1469
redmass: 1.0117 4.0243 4.2770 4.0632 4.5029 3.6308 2.8674 3.9428 2.9720 4.2261 4.6064 1.4150 2.3164 3.5353 3.3783 3.6355 2.6136 2.4131 1.1347 2.8964 3.1670 2.8235 3.3367 3.7573 3.9639 3.5443 2.9827 3.3617 2.7003 4.5642 3.5678 6.3528 3.8940 5.3702 4.0732 3.3768 3.2658 2.7725 3.2804 1.7219 2.8174 2.1746 2.2575 1.3196 1.8291 3.2459 2.5478 1.6390 1.4232 2.6647 1.4853 2.3803 1.4018 1.4146 2.1866 2.9137 2.3069 2.0700 1.5580 2.2244 1.6299 1.4195 1.4070 1.8340 1.5833 1.4704 1.6027 1.6342 1.6531 1.2595 1.5799 1.9143 1.8881 2.6809 1.6606 1.7962 1.4508 1.6925 2.0710 1.5687 1.4212 1.3139 1.4608 1.4966 1.3547 1.4413 1.4049 3.9313 1.2268 5.8270 2.4581 1.1741 3.5486 1.0862 1.0785 1.0757 1.0534 1.0977 1.0804 1.4109 1.7771 2.6393 5.9386 7.4435 6.3570 7.0170 1.0744 1.0766 1.0594 1.0695 1.0386 1.0771 1.0820 1.0670 1.0956 1.0889 1.0715 1.0948 1.0980 1.0996 1.1001 1.0870 1.0877 1.0892 1.0960 1.0959 1.0946 1.0926 1.0660
irintensity: 0.4752 0.0510 0.2670 0.5068 0.6742 0.4470 0.6916 0.3163 1.4184 3.4157 0.5746 0.9529 2.9496 2.1948 2.2934 2.6475 2.7915 0.8050 126.9571 11.8003 2.5470 0.4615 0.6467 1.0331 1.8166 11.4294 0.0815 16.6440 6.9390 9.0149 6.1349 1.4798 3.3289 5.2664 9.7505 1.1991 42.4631 3.8915 12.7858 31.9348 18.4238 5.2118 10.1325 1.3301 0.0677 2.0306 0.2602 19.9920 2.3977 23.3022 1.3968 12.2448 0.5049 0.5494 23.7227 5.0752 16.5021 19.6569 17.4524 41.6130 30.0158 3.1477 6.9271 14.9801 38.7315 31.4893 107.9869 4.9505 6.3020 2.3567 1.9766 8.4671 0.8694 0.2783 7.3680 34.5951 0.7436 7.0509 34.0059 8.6583 5.5049 3.6873 16.2838 0.5048 0.8598 5.3634 1.3506 1.0516 9.1335 42.0089 4.2836 4.9698 5.5854 8.4052 19.7455 1.7694 13.7663 12.3454 11.4261 33.5872 26.1968 42.1094 0.8921 33.2702 3.7542 61.4804 45.7664 96.8957 251.6870 19.3202 47.6943 21.8367 74.6723 52.8625 35.7314 37.7060 43.0744 24.6250 32.5157 18.6018 30.5978 15.2524 16.7431 22.2943 31.2552 21.9106 3.3278 2.3046 37.4647
temp: 298.150 k
press: 1.00000 atm
elementType: 8 7 6 6 6 6 6 6 6 6 6 6 6 6 6 6 6 6 6 6 6 6 1 1 1 1 1 1 1 1 1 1 1 1 1 1 1 1 1 1 1 1 1 1 1
symmnumber: 1
zpe: 994237.6 jmol-1
zpe.correction: 0.378685 hartree
zpe.thermalcorrener: 0.397464 hartree
zpe.thermalcorrenthalpy: 0.398408 hartree
zpe.thermalcorrgfe: 0.331995 hartree
zpe.sumelectzpe: -904.294007 hartree
zpe.sumelectthermal: -904.275228 hartree
zpe.sumelectthermalent: -904.274284 hartree
zpe.sumelectthermalfe: -904.340696 hartree
dipole: -1.1138 1.6958 0.5686
dipole: 2.1071
quadrupole: -112.0188 -131.7138 -125.1649
quadrupole: 0.0993 -5.8742 -1.5936
quadrupole: 10.9470 -8.7480 -2.1991 0.0993 -5.8742 -1.5936
hfenergy: -904.6726919 hartree
pointgroup: C01 [X(C20H23N1O1)]
dipole: 0.402817 -0.6819677 0.2446888 debye
polarizability: 266.1183518|-4.1524195|214.3738152|13.3733441|-2.8088554|180.1559245 unknown
InChI: InChI=1S/C20H23NO/c1-13-5-7-14(8-6-13)19-17-4-3-11-21(2)20(17)16-10-9-15(22)12-18(16)19/h5-10,12,17,19-20,22H,3-4,11H2,1-2H3
charge 0 multiplicity 1
45 atoms
O  3.658706 3.320245 0.125188
N  0.471287 -2.208948 0.973701
C  0.277456 -1.452243 -1.443772
C  1.229717 -1.853778 -0.26601
C  0.058301 0.114836 -1.313162
C  -0.971525 -2.345948 -1.609937
C  2.045852 -0.57711 -0.085557
C  1.356089 0.538914 -0.628604
C  -1.616661 -2.749761 -0.266143
C  -0.544596 -3.260817 0.710825
C  -1.219245 0.607858 -0.627996
C  3.311675 -0.399747 0.506202
C  1.893956 1.834523 -0.547014
C  1.361379 -2.574312 2.093047
C  -2.320501 1.023001 -1.418486
C  -1.349984 0.681017 0.782904
C  3.155322 2.005037 0.070752
C  3.873025 0.896847 0.586872
C  -3.516789 1.484557 -0.824536
C  -2.542113 1.148691 1.374114
C  -3.65077 1.553695 0.584691
C  -4.942258 2.028697 1.229604
H  0.895386 -1.564862 -2.358892
H  1.875767 -2.720044 -0.570179
H  0.033766 0.529253 -2.341152
H  -0.670456 -3.269653 -2.146243
H  -1.7150 -1.836229 -2.253126
H  -2.127628 -1.886224 0.191846
H  -2.373654 -3.54015 -0.435308
H  -1.010303 -3.53253 1.676686
H  -0.070407 -4.193224 0.299265
H  3.874832 -1.2561 0.894242
H  1.3734 2.708423 -0.950312
H  0.750042 -2.850183 2.97065
H  1.993407 -1.715563 2.373432
H  2.03419 -3.439198 1.854424
H  -2.23642 0.998917 -2.513117
H  -0.518021 0.345676 1.41057
H  4.86181 1.043001 1.041547
H  -4.351225 1.803474 -1.461861
H  -2.61594 1.201164 2.467841
H  4.542356 3.337814 0.56949
H  -5.477255 2.747897 0.584226
H  -5.630401 1.181131 1.417387
H  -4.752771 2.517657 2.2017
