program: Orca
programVersion: 5.0.2
elementType: Cl O O N C C C C C C C C C C C C C C C C C H H H H H H H H H H H H H H H H H H H H H H H H H H
charge: 0
multiplicity: 1
keywords: wb97x-d3
keywords: def2-TZVPP
keywords: def2/J RIJCOSX
keywords: DEFGRID2
keywords: scfconv7
keywords: smallprint printgap noloewdin
keywords: NOSOSCF
formula: C17H26ClNO2
InChI: InChI=1/C17H26ClNO2/c1-4-7-11-21-13-19(16(20)12-18)17-14(5-2)9-8-10-15(17)6-3/h8-10H,4-7,11-13H2,1-3H3
47 atoms
Cl -2.728125 1.399342 2.108645
O  2.168553 -0.006237 -0.037765
O  0.639567 2.284232 1.663339
N  0.042327 0.278517 0.805196
C  -0.862007 -0.510415 0.029779
C  -1.549072 -1.553808 0.669442
C  -1.005195 -0.262931 -1.340414
C  -1.358097 -1.842011 2.137177
C  -0.277065 0.8318 -2.078473
C  1.34512 -0.277665 1.062447
C  -2.394968 -2.346401 -0.09817
C  -1.876936 -1.073842 -2.064803
C  4.226051 -0.338679 -1.197764
C  3.492646 -0.480058 0.118972
C  -2.561959 -2.107123 -1.453375
C  -0.203517 1.567832 1.148955
C  4.298854 1.08805 -1.729603
C  -2.612177 -2.309736 2.863297
C  0.65667 0.293068 -3.158843
C  -1.602243 2.102421 0.907422
C  5.004216 1.164166 -3.07469
H  -0.973735 -0.955777 2.640908
H  -0.577865 -2.602791 2.244034
H  0.295999 1.46286 -1.4017
H  -1.017145 1.488777 -2.542719
H  1.241048 -1.358141 1.208518
H  1.751739 0.144136 1.986542
H  -2.937715 -3.160703 0.363614
H  -2.014763 -0.88951 -3.123408
H  3.757013 -0.989289 -1.943278
H  5.238661 -0.725448 -1.051507
H  3.487227 -1.532638 0.43009
H  4.005398 0.08588 0.908655
H  -3.231412 -2.730014 -2.032477
H  3.293701 1.504118 -1.833197
H  4.817526 1.71963 -1.002155
H  -3.42724 -1.594561 2.747812
H  -2.407767 -2.411196 3.929182
H  -2.964731 -3.279102 2.512023
H  1.40523 -0.378522 -2.738343
H  1.180754 1.112309 -3.651997
H  0.110826 -0.256524 -3.925945
H  -1.594905 3.178968 1.053926
H  -1.990813 1.883694 -0.083717
H  4.475045 0.577933 -3.82869
H  6.02372 0.778635 -3.015275
H  5.060775 2.190809 -3.438245
elementType: Cl O N C H
totalener: -1328.98771061 hartree
nucrepener: 1971.12822097 hartree
electener: -3300.11593159 hartree
oneelecener: -5734.17533375 hartree
twoeener: 2434.05940216 hartree
cpcmener: -0.03079287 hartree
kineticenergy: 1324.27269504 hartree
xcener: -107.426418689027 hartree
chargesum: 0.0000000
charge: -0.152236 -0.365070 -0.511425 -0.018328 0.136133 -0.096621 -0.175296 -0.191107 -0.170909 0.117893 -0.069494 -0.089743 -0.153792 0.012038 -0.203316 0.294569 -0.086122 -0.266374 -0.294839 -0.039863 -0.280618 0.088685 0.098881 0.083177 0.101913 0.126217 0.106160 0.146126 0.145195 0.073677 0.085132 0.091017 0.086625 0.157861 0.055561 0.070996 0.080408 0.095536 0.089226 0.078217 0.099929 0.102172 0.145402 0.143814 0.079455 0.082187 0.090952
qa: -0.1522 -0.3651 -0.5114 -0.0183 0.1361 -0.0966 -0.1753 -0.1911 -0.1709 0.1179 -0.0695 -0.0897 -0.1538 0.0120 -0.2033 0.2946 -0.0861 -0.2664 -0.2948 -0.0399 -0.2806 0.0887 0.0989 0.0832 0.1019 0.1262 0.1062 0.1461 0.1452 0.0737 0.0851 0.0910 0.0866 0.1579 0.0556 0.0710 0.0804 0.0955 0.0892 0.0782 0.0999 0.1022 0.1454 0.1438 0.0795 0.0822 0.0910
va: 1.1251 1.9361 1.9873 3.0182 3.6111 3.7385 3.7665 3.8753 3.8500 3.8959 3.7740 3.8152 3.9153 3.9094 3.9811 4.1231 3.8483 3.9314 3.9190 3.9614 3.9419 1.0133 0.9990 1.0215 0.9996 0.9849 1.0043 0.9959 0.9959 1.0049 1.0149 0.9945 0.9938 0.9922 1.0121 1.0097 1.0094 1.0043 1.0005 1.0132 1.0009 1.0080 1.0133 1.0103 1.0003 1.0011 1.0037
dispcorr: -0.026676420 hartree
energy: -1329.014387031745
dipole: 24.94242 -24.99332 -0.05090 -8.93558 7.35631 -1.57927 -18.10265 17.11054 -0.99211
magnitude: 1.86573 au
magnitude: 4.74232 debye
