program: Orca
programVersion: 5.0.2
elementType: Cl O O N C C C C C C C C C C C C C C C C C H H H H H H H H H H H H H H H H H H H H H H H H H H
charge: 0
multiplicity: 1
keywords: wb97x-d3
keywords: def2-TZVPP
keywords: def2/J RIJCOSX
keywords: DEFGRID2
keywords: scfconv7
keywords: smallprint printgap noloewdin
keywords: NOSOSCF
formula: C17H26ClNO2
InChI: InChI=1/C17H26ClNO2/c1-4-7-11-21-13-19(16(20)12-18)17-14(5-2)9-8-10-15(17)6-3/h8-10H,4-7,11-13H2,1-3H3
47 atoms
Cl -2.687168 2.338197 1.232948
O  1.947866 -0.106857 -1.077619
O  0.674911 2.495356 0.860319
N  -0.135795 0.651516 -0.178908
C  -1.115293 -0.38895 -0.246122
C  -0.950811 -1.554828 0.512143
C  -2.219633 -0.216257 -1.092047
C  0.226828 -1.801269 1.418187
C  -2.41387 0.996649 -1.964612
C  0.83932 0.724032 -1.256854
C  -1.932499 -2.538661 0.428005
C  -3.173729 -1.227516 -1.146178
C  4.160508 -0.496411 -0.251126
C  2.922042 0.369656 -0.161281
C  -3.037296 -2.378425 -0.389455
C  -0.139308 1.586759 0.801839
C  5.24232 -0.009613 0.705282
C  1.131978 -2.918969 0.905451
C  -2.288794 0.667439 -3.450535
C  -1.23057 1.498619 1.851579
C  6.498152 -0.86448 0.653556
H  -0.147758 -2.073792 2.407664
H  0.814928 -0.895558 1.558635
H  -1.709419 1.786507 -1.706241
H  -3.408644 1.406003 -1.776004
H  1.136732 1.76653 -1.393996
H  0.353405 0.383808 -2.169556
H  -1.82825 -3.438958 1.021568
H  -4.039683 -1.102821 -1.785223
H  4.544084 -0.486111 -1.27576
H  3.903565 -1.53414 -0.016234
H  2.53651 0.349732 0.864817
H  3.17687 1.41119 -0.394573
H  -3.795465 -3.149364 -0.433513
H  5.496622 1.02724 0.467377
H  4.848344 -0.000404 1.725657
H  0.601856 -3.870689 0.856517
H  1.987244 -3.05258 1.568425
H  1.511365 -2.698783 -0.091571
H  -3.041395 -0.055865 -3.765679
H  -1.309916 0.250144 -3.690141
H  -2.423157 1.566011 -4.05354
H  -1.517868 0.486766 2.120293
H  -0.901087 2.025239 2.742529
H  6.931488 -0.872974 -0.347987
H  6.285452 -1.898743 0.928976
H  7.260574 -0.491906 1.338432
elementType: Cl O N C H
totalener: -1328.98958551 hartree
nucrepener: 1959.58830434 hartree
electener: -3288.57788986 hartree
oneelecener: -5710.50894193 hartree
twoeener: 2421.93105207 hartree
cpcmener: -0.02982994 hartree
kineticenergy: 1324.26376536 hartree
xcener: -107.423597704964 hartree
chargesum: -0.0000000
charge: -0.153435 -0.385539 -0.518235 0.017484 0.117885 -0.154583 -0.156579 -0.155002 -0.158891 0.103826 -0.085361 -0.078911 -0.098054 -0.007641 -0.202663 0.308295 -0.083980 -0.288923 -0.259337 -0.050632 -0.287533 0.100488 0.084553 0.076147 0.088795 0.123229 0.130485 0.144281 0.144125 0.068224 0.062905 0.085396 0.103615 0.158088 0.060323 0.061039 0.098232 0.100329 0.077143 0.087226 0.085341 0.094138 0.143984 0.149592 0.079396 0.080186 0.090553
qa: -0.1534 -0.3855 -0.5182 0.0175 0.1179 -0.1546 -0.1566 -0.1550 -0.1589 0.1038 -0.0854 -0.0789 -0.0981 -0.0076 -0.2027 0.3083 -0.0840 -0.2889 -0.2593 -0.0506 -0.2875 0.1005 0.0846 0.0761 0.0888 0.1232 0.1305 0.1443 0.1441 0.0682 0.0629 0.0854 0.1036 0.1581 0.0603 0.0610 0.0982 0.1003 0.0771 0.0872 0.0853 0.0941 0.1440 0.1496 0.0794 0.0802 0.0906
va: 1.1213 1.9253 1.9740 2.9635 3.6293 3.7949 3.7656 3.8286 3.8826 3.8952 3.8007 3.8045 3.8994 3.8749 3.9672 4.1156 3.8819 3.9060 3.9305 3.9618 3.9514 1.0021 1.0198 1.0148 1.0024 1.0116 1.0003 0.9968 0.9975 1.0166 1.0109 0.9804 1.0033 0.9913 1.0082 1.0061 1.0068 1.0015 1.0201 1.0039 1.0035 1.0047 1.0113 1.0101 0.9999 1.0001 1.0033
dispcorr: -0.026847655 hartree
energy: -1329.016433169455
dipole: 29.03774 -29.38244 -0.34470 -16.50371 15.03668 -1.46703 -6.64333 6.76056 0.11723
magnitude: 1.51154 au
magnitude: 3.84202 debye
