program: Orca
programVersion: 5.0.2
elementType: Cl O O N C C C C C C C C C C C C C C C C C H H H H H H H H H H H H H H H H H H H H H H H H H H
charge: 0
multiplicity: 1
keywords: wb97x-d3
keywords: def2-TZVPP
keywords: def2/J RIJCOSX
keywords: DEFGRID2
keywords: scfconv7
keywords: smallprint printgap noloewdin
keywords: NOSOSCF
formula: C17H26ClNO2
InChI: InChI=1/C17H26ClNO2/c1-4-7-11-21-13-19(16(20)12-18)17-14(5-2)9-8-10-15(17)6-3/h8-10H,4-7,11-13H2,1-3H3
47 atoms
Cl -2.727135 1.367865 2.302115
O  2.118747 -0.2197 -0.295039
O  0.57873 2.100915 1.825794
N  -0.023502 0.255912 0.653073
C  -1.035804 -0.480653 -0.038425
C  -1.710561 -1.497093 0.651672
C  -1.329072 -0.188618 -1.376263
C  -1.405068 -1.872341 2.078406
C  -0.615021 0.869406 -2.175327
C  1.2792 -0.374781 0.809347
C  -2.704376 -2.203044 -0.018571
C  -2.338194 -0.914249 -2.004137
C  3.815127 0.995171 -1.475264
C  2.734514 1.054482 -0.417384
C  -3.02346 -1.912317 -1.334033
C  -0.263739 1.471094 1.205375
C  4.979403 0.072493 -1.136943
C  -0.778729 -3.260304 2.193717
C  0.274772 0.270518 -3.261543
C  -1.655458 2.054472 1.041533
C  6.082912 0.135829 -2.181393
H  -2.336343 -1.855691 2.648607
H  -0.752067 -1.138257 2.54954
H  -0.018227 1.517063 -1.535048
H  -1.361383 1.515326 -2.644121
H  1.122868 -1.446279 0.920891
H  1.744534 0.000534 1.723821
H  -3.244319 -2.982222 0.506302
H  -2.589908 -0.685249 -3.032892
H  4.18929 2.015417 -1.602332
H  3.377084 0.712337 -2.438011
H  3.171012 1.352019 0.54468
H  1.996116 1.815959 -0.691823
H  -3.811199 -2.460043 -1.834785
H  5.384862 0.34999 -0.15919
H  4.62899 -0.95794 -1.042245
H  -0.568835 -3.499913 3.236415
H  0.160255 -3.326354 1.642888
H  -1.443433 -4.032535 1.805427
H  1.030707 -0.389113 -2.836861
H  0.787219 1.057438 -3.815596
H  -0.30852 -0.310362 -3.977149
H  -1.604013 3.127648 1.203467
H  -2.112592 1.862754 0.075398
H  6.486655 1.146109 -2.271093
H  5.713707 -0.157672 -3.165846
H  6.911125 -0.527697 -1.929838
elementType: Cl O N C H
totalener: -1328.98945069 hartree
nucrepener: 1965.76908462 hartree
electener: -3294.75853531 hartree
oneelecener: -5722.96237049 hartree
twoeener: 2428.20383518 hartree
cpcmener: -0.02935957 hartree
kineticenergy: 1324.26118069 hartree
xcener: -107.423543095470 hartree
chargesum: 0.0000000
charge: -0.153566 -0.387214 -0.515753 0.017290 0.128602 -0.161976 -0.158469 -0.159559 -0.163549 0.104736 -0.074938 -0.085880 -0.127076 -0.020896 -0.203713 0.303828 -0.064827 -0.260720 -0.287613 -0.048314 -0.282186 0.089022 0.077409 0.084197 0.102373 0.131072 0.121631 0.143255 0.143863 0.073207 0.070080 0.104647 0.106653 0.158160 0.055897 0.053724 0.094799 0.086209 0.087583 0.077811 0.100698 0.098173 0.148853 0.144321 0.078811 0.079168 0.090180
qa: -0.1536 -0.3872 -0.5158 0.0173 0.1286 -0.1620 -0.1585 -0.1596 -0.1635 0.1047 -0.0749 -0.0859 -0.1271 -0.0209 -0.2037 0.3038 -0.0648 -0.2607 -0.2876 -0.0483 -0.2822 0.0890 0.0774 0.0842 0.1024 0.1311 0.1216 0.1433 0.1439 0.0732 0.0701 0.1046 0.1067 0.1582 0.0559 0.0537 0.0948 0.0862 0.0876 0.0778 0.1007 0.0982 0.1489 0.1443 0.0788 0.0792 0.0902
va: 1.1205 1.9124 1.9766 2.9695 3.5988 3.7624 3.7895 3.8855 3.8303 3.8958 3.8008 3.8012 3.9113 3.8776 3.9695 4.1215 3.8439 3.9300 3.9051 3.9591 3.9502 1.0022 1.0146 1.0222 1.0016 1.0017 1.0116 0.9975 0.9968 1.0134 1.0103 1.0036 0.9867 0.9912 1.0097 1.0214 1.0044 1.0033 1.0038 1.0197 1.0020 1.0063 1.0113 1.0111 1.0006 1.0005 1.0037
dispcorr: -0.027064001 hartree
energy: -1329.016514691685
dipole: 28.56683 -29.07760 -0.51077 -9.05203 8.50103 -0.55099 -18.90117 17.62069 -1.28048
magnitude: 1.48463 au
magnitude: 3.77362 debye
