program: Orca
programVersion: 5.0.2
elementType: Cl O O N C C C C C C C C C C C C C C C C C H H H H H H H H H H H H H H H H H H H H H H H H H H
charge: 0
multiplicity: 1
keywords: wb97x-d3
keywords: def2-TZVPP
keywords: def2/J RIJCOSX
keywords: DEFGRID2
keywords: scfconv7
keywords: smallprint printgap noloewdin
keywords: NOSOSCF
formula: C17H26ClNO2
InChI: InChI=1/C17H26ClNO2/c1-4-7-11-21-13-19(16(20)12-18)17-14(5-2)9-8-10-15(17)6-3/h8-10H,4-7,11-13H2,1-3H3
47 atoms
Cl -2.37663 1.86141 1.932081
O  2.161845 -1.047734 -0.042473
O  1.015984 1.809298 1.696054
N  0.137693 -0.019942 0.685229
C  -0.940229 -0.645169 -0.015326
C  -1.873425 -1.38443 0.724392
C  -1.011366 -0.559506 -1.412234
C  -1.804825 -1.544151 2.221267
C  -0.020892 0.219546 -2.24081
C  1.271315 -0.869965 1.020023
C  -2.901768 -2.023564 0.038504
C  -2.052414 -1.224097 -2.055947
C  3.975874 -0.295955 -1.405932
C  3.065057 0.030399 -0.241581
C  -2.991637 -1.947119 -1.340616
C  0.113819 1.280474 1.064614
C  5.08839 0.734345 -1.576825
C  -1.484248 -2.975795 2.643343
C  -0.672091 1.226533 -3.18374
C  -1.109768 2.09476 0.687771
C  4.59494 2.152287 -1.832626
H  -2.769686 -1.258006 2.645504
H  -1.072225 -0.866789 2.658098
H  0.577177 -0.484569 -2.82576
H  0.68185 0.751487 -1.602919
H  0.88708 -1.858479 1.265865
H  1.768915 -0.466009 1.904537
H  -3.639465 -2.587645 0.59696
H  -2.126831 -1.177904 -3.13531
H  3.384968 -0.356137 -2.325671
H  4.422363 -1.281744 -1.249514
H  3.656449 0.192766 0.669881
H  2.521166 0.958379 -0.444843
H  -3.795332 -2.452355 -1.860475
H  5.727396 0.726451 -0.688965
H  5.723783 0.4211 -2.408143
H  -0.518195 -3.303589 2.25775
H  -2.238117 -3.678359 2.286761
H  -1.450143 -3.053536 3.730453
H  0.093168 1.772056 -3.736553
H  -1.267689 1.956378 -2.633506
H  -1.323197 0.748881 -3.915591
H  -0.840783 3.147548 0.688191
H  -1.537661 1.837234 -0.276669
H  3.923394 2.190307 -2.692675
H  5.429824 2.823372 -2.037516
H  4.056785 2.562332 -0.976932
elementType: Cl O N C H
totalener: -1328.98782757 hartree
nucrepener: 1974.68583332 hartree
electener: -3303.67366089 hartree
oneelecener: -5740.60693554 hartree
twoeener: 2436.93327465 hartree
cpcmener: -0.03065798 hartree
kineticenergy: 1324.25573700 hartree
xcener: -107.424079836167 hartree
chargesum: 0.0000000
charge: -0.155086 -0.387782 -0.518181 0.013082 0.095238 -0.144838 -0.139901 -0.164898 -0.168673 0.110672 -0.083682 -0.086741 -0.099825 -0.018103 -0.197640 0.306541 -0.113688 -0.259131 -0.257708 -0.044652 -0.279432 0.089728 0.076031 0.096914 0.079859 0.134263 0.119035 0.143758 0.147487 0.070309 0.071516 0.108341 0.086771 0.158072 0.059432 0.072671 0.083800 0.086570 0.094700 0.095286 0.082248 0.089047 0.151429 0.139361 0.082301 0.094415 0.081082
qa: -0.1551 -0.3878 -0.5182 0.0131 0.0952 -0.1448 -0.1399 -0.1649 -0.1687 0.1107 -0.0837 -0.0867 -0.0998 -0.0181 -0.1976 0.3065 -0.1137 -0.2591 -0.2577 -0.0447 -0.2794 0.0897 0.0760 0.0969 0.0799 0.1343 0.1190 0.1438 0.1475 0.0703 0.0715 0.1083 0.0868 0.1581 0.0594 0.0727 0.0838 0.0866 0.0947 0.0953 0.0822 0.0890 0.1514 0.1394 0.0823 0.0944 0.0811
va: 1.1217 1.9290 1.9740 2.9587 3.6749 3.7577 3.8389 3.8812 3.8998 3.8927 3.8087 3.7911 3.8722 3.8861 3.9653 4.1152 3.9060 3.9321 3.9198 3.9590 3.9287 1.0020 1.0153 1.0022 1.0039 0.9987 1.0153 0.9976 0.9955 1.0134 1.0197 0.9980 0.9700 0.9916 1.0087 1.0077 1.0036 1.0042 1.0045 1.0049 1.0032 1.0045 1.0082 1.0194 1.0010 1.0039 0.9987
dispcorr: -0.027092772 hartree
energy: -1329.014920341684
dipole: 21.96875 -22.38468 -0.41594 -5.52116 4.86714 -0.65401 -16.34677 15.02995 -1.31682
magnitude: 1.52799 au
magnitude: 3.88384 debye
