program: Orca
programVersion: 5.0.2
elementType: Cl O O N C C C C C C C C C C C C C C C C C H H H H H H H H H H H H H H H H H H H H H H H H H H
charge: 0
multiplicity: 1
keywords: wb97x-d3
keywords: def2-TZVPP
keywords: def2/J RIJCOSX
keywords: DEFGRID2
keywords: scfconv7
keywords: smallprint printgap noloewdin
keywords: NOSOSCF
formula: C17H26ClNO2
InChI: InChI=1/C17H26ClNO2/c1-4-7-11-21-13-19(16(20)12-18)17-14(5-2)9-8-10-15(17)6-3/h8-10H,4-7,11-13H2,1-3H3
47 atoms
Cl -3.494449 2.346609 2.088626
O  1.893253 0.602532 -0.424365
O  -0.62078 2.576578 1.979549
N  -0.130934 0.846634 0.613538
C  -0.558956 -0.324689 -0.085417
C  -0.55211 -1.555117 0.582381
C  -0.95132 -0.220462 -1.424925
C  -0.129068 -1.703243 2.018912
C  -0.970389 1.083489 -2.179553
C  1.30034 1.087746 0.736505
C  -0.936758 -2.691976 -0.121584
C  -1.340736 -1.381317 -2.087893
C  3.780463 -0.201772 -1.622963
C  3.299266 0.45969 -0.34744
C  -1.329004 -2.608573 -1.447129
C  -0.988958 1.639545 1.291697
C  3.258846 -1.620879 -1.845277
C  1.263856 -2.3142 2.151207
C  0.001247 1.104258 -3.355933
C  -2.455431 1.272664 1.130578
C  3.81073 -2.636998 -0.855985
H  -0.848286 -2.348592 2.527967
H  -0.158475 -0.745506 2.539259
H  -0.750261 1.920588 -1.518104
H  -1.983251 1.2511 -2.554844
H  1.697602 0.579777 1.626005
H  1.470934 2.161703 0.85714
H  -0.938438 -3.65063 0.383745
H  -1.658766 -1.319511 -3.121821
H  4.873746 -0.214107 -1.597028
H  3.504709 0.431386 -2.471597
H  3.570701 -0.136404 0.533509
H  3.77799 1.43969 -0.22926
H  -1.635742 -3.500023 -1.978884
H  2.165299 -1.630525 -1.814564
H  3.528235 -1.931117 -2.857513
H  1.305953 -3.304722 1.696783
H  1.542163 -2.416942 3.200412
H  2.019509 -1.69458 1.667264
H  -0.075971 2.048143 -3.896069
H  -0.205874 0.302796 -4.065417
H  1.032947 0.995436 -3.021992
H  -2.76362 1.350396 0.088464
H  -2.636797 0.249629 1.45808
H  4.899721 -2.690283 -0.913716
H  3.421655 -3.635554 -1.059144
H  3.548707 -2.395079 0.17465
elementType: Cl O N C H
totalener: -1328.98538180 hartree
nucrepener: 1989.53384867 hartree
electener: -3318.51923048 hartree
oneelecener: -5770.27223439 hartree
twoeener: 2451.75300391 hartree
cpcmener: -0.03405205 hartree
kineticenergy: 1324.26612784 hartree
xcener: -107.427824108487 hartree
chargesum: -0.0000000
charge: -0.154025 -0.351715 -0.522052 -0.014508 0.107674 -0.150928 -0.112340 -0.151093 -0.170173 0.067859 -0.081199 -0.069750 -0.142093 -0.024211 -0.190186 0.320591 -0.067460 -0.274928 -0.257188 -0.072283 -0.289975 0.092328 0.086427 0.083316 0.097203 0.126287 0.118597 0.142452 0.142215 0.081841 0.087369 0.090915 0.103252 0.158858 0.028665 0.076346 0.094597 0.102315 0.073200 0.096515 0.086210 0.067446 0.148810 0.151948 0.088867 0.094304 0.079696
qa: -0.1540 -0.3517 -0.5221 -0.0145 0.1077 -0.1509 -0.1123 -0.1511 -0.1702 0.0679 -0.0812 -0.0697 -0.1421 -0.0242 -0.1902 0.3206 -0.0675 -0.2749 -0.2572 -0.0723 -0.2900 0.0923 0.0864 0.0833 0.0972 0.1263 0.1186 0.1425 0.1422 0.0818 0.0874 0.0909 0.1033 0.1589 0.0287 0.0763 0.0946 0.1023 0.0732 0.0965 0.0862 0.0674 0.1488 0.1519 0.0889 0.0943 0.0797
va: 1.1253 1.9332 1.9806 2.9851 3.5511 3.8026 3.7542 3.8559 3.8614 3.9114 3.7887 3.7820 3.9054 3.9002 3.9540 4.1064 3.8569 3.9337 3.9249 4.0020 3.9358 1.0014 1.0119 1.0172 0.9986 0.9774 1.0140 0.9978 0.9973 1.0151 1.0056 0.9813 0.9976 0.9903 1.0221 1.0097 1.0004 1.0082 0.9875 1.0067 1.0042 1.0189 1.0051 1.0012 1.0041 1.0040 0.9971
dispcorr: -0.028535912 hartree
energy: -1329.013917716936
dipole: 31.51487 -30.43142 1.08345 -20.77076 18.55295 -2.21781 -16.49031 15.21694 -1.27337
magnitude: 2.77742 au
magnitude: 7.05963 debye
