program: Orca
programVersion: 5.0.2
elementType: Cl O O N C C C C C C C C C C C C C C C C C H H H H H H H H H H H H H H H H H H H H H H H H H H
charge: 0
multiplicity: 1
keywords: wb97x-d3
keywords: def2-TZVPP
keywords: def2/J RIJCOSX
keywords: DEFGRID2
keywords: scfconv7
keywords: smallprint printgap noloewdin
keywords: NOSOSCF
formula: C17H26ClNO2
InChI: InChI=1/C17H26ClNO2/c1-4-7-11-21-13-19(16(20)12-18)17-14(5-2)9-8-10-15(17)6-3/h8-10H,4-7,11-13H2,1-3H3
47 atoms
Cl -1.518909 2.804016 0.641836
O  2.227917 -0.510248 -0.048077
O  0.624839 1.190095 2.482438
N  0.027545 -0.315865 0.897275
C  -1.003866 -0.904785 0.100012
C  -1.747286 -1.956736 0.654362
C  -1.243757 -0.44325 -1.197599
C  -1.507595 -2.486429 2.044519
C  -0.415612 0.613535 -1.878162
C  1.329588 -0.972211 0.913615
C  -2.774256 -2.511393 -0.100716
C  -2.294137 -1.018057 -1.912302
C  4.113964 0.861742 -0.613322
C  2.87478 0.72133 0.244831
C  -3.057227 -2.037034 -1.371795
C  -0.216883 0.726393 1.728542
C  3.853354 0.929457 -2.112668
C  -2.511869 -1.950511 3.061713
C  0.389125 0.037372 -3.03997
C  -1.599013 1.352526 1.691874
C  5.125514 1.187868 -2.905872
H  -0.496559 -2.265757 2.386706
H  -1.585532 -3.575276 2.013737
H  0.255139 1.105274 -1.17601
H  -1.080181 1.392672 -2.257444
H  1.162248 -2.025508 0.693456
H  1.751449 -0.893662 1.919077
H  -3.359907 -3.321444 0.317576
H  -2.509565 -0.658244 -2.91146
H  4.806846 0.044386 -0.38997
H  4.614953 1.780829 -0.294573
H  3.16094 0.749699 1.302006
H  2.197982 1.565282 0.062782
H  -3.869073 -2.467749 -1.943468
H  3.397313 -0.000884 -2.458221
H  3.12584 1.721464 -2.316955
H  -3.535796 -2.186284 2.769558
H  -2.439296 -0.868313 3.174044
H  -2.335158 -2.394738 4.041619
H  -0.261843 -0.389313 -3.803975
H  1.065706 -0.748582 -2.704606
H  0.988094 0.814661 -3.515293
H  -2.38811 0.713836 1.309721
H  -1.859622 1.685746 2.693411
H  5.86148 0.398125 -2.743547
H  5.589129 2.132706 -2.616056
H  4.926126 1.234375 -3.977104
elementType: Cl O N C H
totalener: -1328.98849761 hartree
nucrepener: 1978.27320589 hartree
electener: -3307.26170349 hartree
oneelecener: -5748.03707349 hartree
twoeener: 2440.77537000 hartree
cpcmener: -0.02987379 hartree
kineticenergy: 1324.25722343 hartree
xcener: -107.421579557950 hartree
chargesum: -0.0000000
charge: -0.155767 -0.379205 -0.518193 0.020898 0.086037 -0.112244 -0.134481 -0.145693 -0.146920 0.080168 -0.073399 -0.094635 -0.116849 0.006234 -0.192483 0.325036 -0.067683 -0.275529 -0.302408 -0.090413 -0.284414 0.083110 0.092811 0.055807 0.094523 0.124706 0.126616 0.144348 0.145015 0.065820 0.065098 0.102944 0.083989 0.158855 0.054167 0.054366 0.088726 0.088045 0.098812 0.103135 0.083400 0.097359 0.147637 0.160119 0.080239 0.081384 0.090913
qa: -0.1558 -0.3792 -0.5182 0.0209 0.0860 -0.1122 -0.1345 -0.1457 -0.1469 0.0802 -0.0734 -0.0946 -0.1168 0.0062 -0.1925 0.3250 -0.0677 -0.2755 -0.3024 -0.0904 -0.2844 0.0831 0.0928 0.0558 0.0945 0.1247 0.1266 0.1443 0.1450 0.0658 0.0651 0.1029 0.0840 0.1589 0.0542 0.0544 0.0887 0.0880 0.0988 0.1031 0.0834 0.0974 0.1476 0.1601 0.0802 0.0814 0.0909
va: 1.1187 1.9283 1.9774 2.9407 3.6619 3.8935 3.7956 3.8991 3.8395 3.9260 3.7982 3.8099 3.9427 3.8755 3.9569 4.0782 3.8402 3.9164 3.9337 3.9636 3.9538 1.0059 1.0010 1.0277 1.0086 0.9955 1.0055 0.9977 0.9966 1.0171 1.0121 1.0079 0.9873 0.9907 1.0126 1.0058 1.0020 1.0023 1.0046 1.0093 1.0093 1.0010 1.0064 1.0026 0.9997 1.0002 1.0034
dispcorr: -0.027973996 hartree
energy: -1329.016471605020
dipole: 18.10751 -19.22628 -1.11877 -10.18783 8.67386 -1.51396 -11.14846 10.87919 -0.26927
magnitude: 1.90164 au
magnitude: 4.83359 debye
