program: Gaussian 09
title: 000055847
version: EM64L-G09RevD.01
frameworkgroup: C1[X(C9H11NO3)]
method: RPBEPBE
basis: SDD
operation: Freq
keyword: #p
keyword: freq=noraman
keyword: PBEPBE/SDD
title: #p freq=noraman PBEPBE/SDD
converged: YES YES NO NO
title: Mulliken charges:
elementType: O O O N C C C C C C C C C H H H H H H H H H H H
charge: -0.264755 -0.467745 -0.273914 -0.438980 0.343951 0.481459 -0.329816 -0.365330 -0.444699 -0.330056 -0.244048 -0.684557 0.193402 0.246099 0.250888 0.219282 0.299558 0.206295 0.206354 0.333910 0.206466 0.232908 0.232721 0.390607
chargesum: 0.00000
title: Mulliken charges with hydrogens summed into heavy atoms:
elementType: O O O N C C C C C C C C C
charge: -0.264755 -0.077138 -0.273914 -0.105069 0.343951 0.481459 -0.083718 -0.114442 -0.225418 -0.030497 0.168601 -0.012462 0.193402
polarizability: 1.98489539e+02 -2.94365094e+00 1.11259291e+02 -1.06517977e-01 -2.66171948e-03 5.65018326e+01
1716.lowfreq: -5.8566 -5.1199 -0.0007 0.0004 0.0008 8.7824 37.5247 61.1751 89.0935
frequency: 37.4062 61.1698 89.0878 105.7092 115.6977 173.1045 187.3709 247.3210 267.8621 323.4631 372.1418 386.3100 415.0305 440.4617 479.6654 523.1386 545.1526 618.5633 643.4256 649.3222 696.1643 719.2801 753.9887 797.2679 829.2610 838.8949 849.7380 902.7647 919.6323 950.8310 980.3302 1000.5348 1037.7957 1092.5012 1116.2815 1127.1473 1134.9977 1182.3725 1219.6077 1252.0559 1258.9044 1277.1325 1312.7116 1360.0885 1381.2920 1400.0688 1428.0246 1461.0398 1476.5979 1487.4540 1502.1936 1522.7535 1594.3520 1633.2213 1688.0528 2949.2750 2996.8481 3006.9396 3094.2527 3105.8206 3118.2931 3161.1524 3164.3920 3188.6629 3547.2215 3589.7931
redmass: 4.5364 5.1681 5.8207 4.5413 1.8195 5.1118 5.7040 1.1791 4.6748 6.8260 5.8631 4.0743 3.0513 4.7121 1.1014 2.3287 4.9636 6.5161 1.3133 6.3911 5.2785 3.6889 4.6495 1.3483 1.1109 5.2137 1.4900 3.3005 1.3832 9.8581 1.3074 2.7429 2.8231 1.8658 2.1553 1.3171 1.4327 1.2809 2.2558 1.7304 1.1465 2.8578 1.3537 1.5169 3.6004 1.3047 3.8440 1.0401 1.0864 1.1383 1.9594 2.5246 5.2303 6.3610 7.6738 1.0551 1.0362 1.1075 1.0989 1.1013 1.0896 1.0901 1.0938 1.0958 1.0762 1.0652
irintensity: 0.6140 1.6590 0.2085 0.5793 3.2965 4.4037 0.2080 0.6709 1.8203 0.5787 6.7186 3.0084 0.2022 9.2421 221.0630 11.5121 51.1537 8.4784 15.2725 4.8162 47.8347 1.2776 0.0254 53.2511 0.0877 16.6661 70.3720 50.0624 3.0277 138.4756 1.5773 1.8556 76.1244 422.8866 2.5265 19.0963 4.5224 65.5587 243.9765 11.6745 0.0395 2.7334 1.8619 1.0199 85.9130 55.1246 8.6810 11.8781 45.4540 38.1105 26.2843 525.6698 50.6498 0.4860 389.1052 43.9461 26.8516 40.0783 29.6972 34.7049 21.5571 4.8886 11.3922 3.9391 33.8195 83.2211
temp: 298.150 k
press: 1.00000 atm
elementType: 8 8 8 7 6 6 6 6 6 6 6 6 6 1 1 1 1 1 1 1 1 1 1 1
symmnumber: 1
zpe: 495190.5 jmol-1
zpe.correction: 0.188608 hartree
zpe.thermalcorrener: 0.201209 hartree
zpe.thermalcorrenthalpy: 0.202153 hartree
zpe.thermalcorrgfe: 0.148922 hartree
zpe.sumelectzpe: -629.025254 hartree
zpe.sumelectthermal: -629.012653 hartree
zpe.sumelectthermalent: -629.011709 hartree
zpe.sumelectthermalfe: -629.064941 hartree
dipole: 1.5364 -3.4724 0.0110
dipole: 3.7971
quadrupole: -60.1775 -74.2837 -79.7132
quadrupole: 0.0599 0.0310 -0.0004
quadrupole: 11.2139 -2.8922 -8.3217 0.0599 0.0310 -0.0004
hfenergy: -629.2138624 hartree
pointgroup: C01 [X(C9H11N1O3)]
dipole: 0.6163856 1.3598701 -0.0505485 debye
dipolederiv: -2.1312185 -0.0427877 0.085125 0.0416439 -0.3074994 -0.0013123 0.0844115 0.0034855 -0.2847254 -1.5510176 0.3928511 0.0404725 0.6538435 -0.4780622 -0.0274697 0.0359239 -0.0162214 -0.4736883 -0.7735488 -0.058937 0.0184657 -0.4550501 -1.0331175 0.0281739 0.0228641 0.0109349 -0.3566514 -1.7909952 -0.1648543 0.064792 -0.5397641 -0.4171762 0.0240364 0.0685718 0.0080188 -0.3187265 1.6312887 -0.1268369 -0.0683423 -0.47984 -0.0093506 0.0238902 -0.0615758 0.0070271 0.0838678 1.1369663 -0.1085086 -0.0438351 -0.2840607 -0.0975102 0.0140882 -0.0409778 0.0067995 0.0686714 -0.2559706 -0.0919665 0.0046916 0.4070287 -0.0103104 -0.0207986 -0.0033278 0.0014107 -0.1943109 -0.3580341 0.0904831 0.0078366 -0.2251949 0.110271 0.0056019 0.0132893 -0.0080001 -0.165256 -0.0750395 0.1403274 -0.0073928 -0.1487348 0.1070522 0.0020448 -0.0036153 -0.010489 -0.1950619 -0.0592767 -0.0918424 -0.0029701 0.1217357 0.0313471 -0.0078069 -0.0062572 0.0014212 -0.1577751 1.0079254 0.139285 -0.0296409 0.5772223 0.3523759 -0.0256493 -0.0387441 -0.0055498 0.4052235 -0.1474811 0.0553029 0.0092702 0.0156477 0.0512499 -0.0006442 0.0094811 -0.0026634 0.0536993 2.5445968 0.0095564 -0.0941117 0.6654866 1.5158783 -0.0438995 -0.1013035 -0.0158257 0.3098934 -0.0045638 -0.0978073 0.0086716 -0.1189102 0.0059465 0.007547 0.0091759 0.0066566 0.1657544 0.0728638 0.0549992 0.0030544 0.0631956 -0.0349665 0.0001648 0.0032337 0.000312 0.1633451 0.0296285 0.0959247 0.004569 0.0939323 -0.0849295 -0.0004734 0.0045529 -0.0004023 0.16557 0.1291188 -0.0594896 0.0031426 -0.0418847 0.0676871 0.0034639 0.0027104 0.0041845 0.1787595 -0.0415766 0.0464365 -0.0588461 -0.1066205 -0.0530151 0.1088042 -0.0033619 0.119483 -0.094027 -0.0368803 0.0342985 0.0508029 -0.1183741 -0.0595342 -0.0998834 0.0005888 -0.125238 -0.0944142 0.1755399 -0.0515847 0.0074415 -0.0059744 0.158692 0.0026847 0.0071099 0.0046223 0.337618 -0.0981201 -0.0972622 0.011312 -0.1421954 -0.0295787 0.0080951 0.0121 0.005877 0.1134623 0.0996333 0.0095554 -0.0062409 0.0760103 0.022931 0.1019872 -0.0429434 0.1094837 -0.0600021 0.101854 -0.0011679 -0.0097323 0.066038 0.0190037 -0.1105309 0.0258894 -0.1115824 -0.0598441 0.3943072 -0.0759749 0.0014648 -0.1151806 0.1726158 0.007886 0.0022039 0.0062553 0.4086183 unknown
polarizability: 198.2656659|2.0411435|111.1988332|-6.2302884|-0.8509636|56.7861637 unknown
InChI: InChI=1S/C9H11NO3/c1-2-13-8-5-3-7(4-6-8)10-9(11)12/h3-6,10-11H,2H2,1H3
charge 0 multiplicity 1
24 atoms
O  2.99994 -0.624216 -0.183443
O  -4.761048 0.665865 0.130499
O  -3.610564 -1.383524 0.109183
N  -2.499578 0.715101 0.036224
C  1.655673 -0.222231 -0.129026
C  -1.120157 0.356303 -0.017243
C  1.213903 1.124192 -0.128946
C  0.703191 -1.269929 -0.071757
C  -0.168445 1.402809 -0.073287
C  -0.673506 -0.993327 -0.016235
C  4.028464 0.431864 -0.252912
C  5.381074 -0.272309 -0.315669
C  -3.586455 -0.127413 0.092318
H  1.921514 1.956799 -0.17151
H  1.063584 -2.303157 -0.072338
H  -0.502982 2.44816 -0.074109
H  -1.402006 -1.805677 0.026916
H  3.857073 1.055228 -1.155145
H  3.953823 1.080173 0.644934
H  -2.723846 1.712201 0.032717
H  6.195904 0.472939 -0.362224
H  5.532999 -0.902253 0.577311
H  5.443619 -0.916755 -1.208951
H  -5.541373 0.056656 0.170793
