program: Orca
programVersion: 5.0.2
elementType: Cl O O N C C C C C C C C C C C C C C C C C H H H H H H H H H H H H H H H H H H H H H H H H H H
charge: 0
multiplicity: 1
keywords: wb97x-d3
keywords: def2-TZVPP
keywords: def2/J RIJCOSX
keywords: DEFGRID2
keywords: scfconv7
keywords: smallprint printgap noloewdin
keywords: NOSOSCF
formula: C17H26ClNO2
InChI: InChI=1/C17H26ClNO2/c1-4-7-11-21-13-19(16(20)12-18)17-14(5-2)9-8-10-15(17)6-3/h8-10H,4-7,11-13H2,1-3H3
47 atoms
Cl -1.114789 2.966721 2.259802
O  1.91394 -0.445554 -0.892868
O  0.715996 2.14858 0.185936
N  -0.289504 0.258898 -0.532774
C  -1.379546 -0.659928 -0.437724
C  -1.288108 -1.770802 0.409326
C  -2.526989 -0.420969 -1.206834
C  -0.075879 -2.075158 1.247436
C  -2.652481 0.758585 -2.133825
C  0.757413 0.03216 -1.511517
C  -2.372141 -2.643183 0.47153
C  -3.585366 -1.318645 -1.115091
C  4.123221 -0.09008 -0.074924
C  3.128508 0.225024 -1.174123
C  -3.511179 -2.423217 -0.282483
C  -0.192274 1.346915 0.274211
C  3.710815 0.411651 1.304697
C  0.746721 -3.230262 0.681324
C  -2.295784 0.410153 -3.576391
C  -1.301914 1.481083 1.3061
C  4.732787 0.066998 2.377267
H  -0.407841 -2.33903 2.25459
H  0.557753 -1.195896 1.356339
H  -2.033106 1.591667 -1.799134
H  -3.684402 1.114899 -2.102491
H  0.951349 0.957042 -2.063615
H  0.375751 -0.708161 -2.21785
H  -2.320527 -3.501657 1.131208
H  -4.482415 -1.140681 -1.696671
H  5.078307 0.362392 -0.358132
H  4.298233 -1.17056 -0.042352
H  2.969005 1.307478 -1.237471
H  3.529201 -0.097719 -2.143367
H  -4.347041 -3.107886 -0.213825
H  3.567467 1.495849 1.268169
H  2.743897 -0.014041 1.584413
H  1.10042 -3.018499 -0.327282
H  0.163104 -4.150812 0.64141
H  1.620737 -3.420108 1.306057
H  -1.261542 0.076908 -3.669847
H  -2.423096 1.278909 -4.223744
H  -2.93544 -0.385957 -3.960742
H  -2.282894 1.506388 0.832681
H  -1.286868 0.635323 1.99387
H  5.711413 0.496065 2.152491
H  4.861842 -1.013538 2.470027
H  4.426785 0.443915 3.35443
elementType: Cl O N C H
totalener: -1329.00126229 hartree
nucrepener: 1960.99660231 hartree
electener: -3289.99786459 hartree
oneelecener: -5713.57988721 hartree
twoeener: 2423.58202262 hartree
cpcmener: -0.02651779 hartree
kineticenergy: 1324.25030726 hartree
xcener: -107.418508168589 hartree
chargesum: 0.0000000
charge: -0.150169 -0.363667 -0.472552 0.015229 0.095719 -0.174434 -0.118345 -0.124441 -0.153523 0.076309 -0.081876 -0.059043 -0.107904 -0.005698 -0.189981 0.278949 -0.071703 -0.280188 -0.268875 -0.062860 -0.284321 0.093872 0.052470 0.085267 0.088915 0.122078 0.123657 0.142366 0.140085 0.069618 0.064374 0.077324 0.098443 0.155377 0.058550 0.051879 0.083044 0.090141 0.096677 0.085807 0.096104 0.088074 0.144855 0.145621 0.080780 0.078184 0.089812
qa: -0.1502 -0.3637 -0.4726 0.0152 0.0957 -0.1744 -0.1183 -0.1244 -0.1535 0.0763 -0.0819 -0.0590 -0.1079 -0.0057 -0.1900 0.2789 -0.0717 -0.2802 -0.2689 -0.0629 -0.2843 0.0939 0.0525 0.0853 0.0889 0.1221 0.1237 0.1424 0.1401 0.0696 0.0644 0.0773 0.0984 0.1554 0.0586 0.0519 0.0830 0.0901 0.0967 0.0858 0.0961 0.0881 0.1449 0.1456 0.0808 0.0782 0.0898
va: 1.1295 1.9261 2.0313 2.9185 3.6036 3.8588 3.8031 3.8444 3.8728 3.9328 3.8070 3.7960 3.8778 3.9097 3.9677 4.1385 3.8623 3.9143 3.9136 4.0010 3.9571 1.0039 1.0334 1.0099 1.0010 0.9955 0.9936 0.9971 0.9981 1.0156 1.0128 1.0035 0.9946 0.9918 1.0144 1.0080 1.0158 1.0055 1.0024 1.0071 1.0043 1.0024 1.0029 1.0045 1.0008 1.0007 1.0030
dispcorr: -0.026700013 hartree
energy: -1329.027962298248
dipole: 17.69845 -18.83933 -1.14088 -17.31253 15.60021 -1.71232 -9.45971 8.30483 -1.15489
magnitude: 2.35953 au
magnitude: 5.99746 debye
