program: Orca
programVersion: 5.0.2
elementType: Cl O O N C C C C C C C C C C C C C C C C C H H H H H H H H H H H H H H H H H H H H H H H H H H
charge: 0
multiplicity: 1
keywords: wb97x-d3
keywords: def2-TZVPP
keywords: def2/J RIJCOSX
keywords: DEFGRID2
keywords: scfconv7
keywords: smallprint printgap noloewdin
keywords: NOSOSCF
formula: C17H26ClNO2
InChI: InChI=1/C17H26ClNO2/c1-4-7-11-21-13-19(16(20)12-18)17-14(5-2)9-8-10-15(17)6-3/h8-10H,4-7,11-13H2,1-3H3
47 atoms
Cl -1.103723 1.045259 2.755019
O  2.083184 0.115963 -1.032228
O  0.461764 2.797479 0.232638
N  -0.173242 0.733252 -0.449002
C  -1.165466 -0.296996 -0.442157
C  -0.973029 -1.45087 0.324366
C  -2.314682 -0.128213 -1.230354
C  0.267852 -1.718583 1.131432
C  -2.537924 1.070007 -2.116462
C  0.879253 0.664769 -1.459355
C  -1.973019 -2.421772 0.315721
C  -3.287471 -1.12144 -1.206257
C  4.352979 0.385676 -0.325449
C  2.955831 0.971758 -0.310046
C  -3.123103 -2.259933 -0.434636
C  -0.313341 1.860392 0.297033
C  4.503185 -0.980229 0.339167
C  1.110328 -2.835414 0.520945
C  -2.222449 0.773802 -3.580262
C  -1.4930 1.936155 1.251555
C  4.16426 -0.98325 1.822516
H  -0.025361 -2.007571 2.143336
H  0.868328 -0.816886 1.236183
H  -1.95013 1.929146 -1.79191
H  -3.584015 1.374004 -2.034664
H  1.026603 1.664631 -1.87989
H  0.511246 0.012618 -2.249857
H  -1.845423 -3.314472 0.91698
H  -4.187644 -0.994832 -1.796551
H  5.005332 1.104944 0.17985
H  4.704623 0.332539 -1.360219
H  2.60549 1.105665 0.719556
H  2.978436 1.964582 -0.773908
H  -3.893976 -3.020098 -0.41777
H  3.892348 -1.721582 -0.182641
H  5.538036 -1.308878 0.210451
H  1.424378 -2.59164 -0.49431
H  0.557073 -3.774923 0.477742
H  2.006997 -3.012348 1.116594
H  -2.409354 1.652393 -4.199321
H  -2.841606 -0.03881 -3.963122
H  -1.179147 0.487774 -3.71844
H  -1.65114 2.977683 1.519656
H  -2.417841 1.527161 0.853286
H  4.772504 -0.258357 2.368574
H  4.348862 -1.962704 2.266479
H  3.11794 -0.736686 2.009862
elementType: Cl O N C H
totalener: -1328.99872031 hartree
nucrepener: 2001.05993567 hartree
electener: -3330.05865598 hartree
oneelecener: -5793.68378675 hartree
twoeener: 2463.62513076 hartree
cpcmener: -0.02320380 hartree
kineticenergy: 1324.24914518 hartree
xcener: -107.419554957595 hartree
chargesum: -0.0000000
charge: -0.151588 -0.362504 -0.479488 0.029135 0.101016 -0.143217 -0.151097 -0.124708 -0.154199 0.073973 -0.086857 -0.062475 -0.126429 -0.002637 -0.196341 0.279823 -0.099929 -0.303712 -0.264788 -0.053648 -0.303292 0.093127 0.043909 0.084196 0.091613 0.126090 0.124463 0.141590 0.141118 0.067084 0.072623 0.084964 0.098593 0.154713 0.059825 0.079913 0.084883 0.102194 0.098363 0.095502 0.087807 0.087216 0.147827 0.143567 0.094220 0.098158 0.079399
qa: -0.1516 -0.3625 -0.4795 0.0291 0.1010 -0.1432 -0.1511 -0.1247 -0.1542 0.0740 -0.0869 -0.0625 -0.1264 -0.0026 -0.1963 0.2798 -0.0999 -0.3037 -0.2648 -0.0536 -0.3033 0.0931 0.0439 0.0842 0.0916 0.1261 0.1245 0.1416 0.1411 0.0671 0.0726 0.0850 0.0986 0.1547 0.0598 0.0799 0.0849 0.1022 0.0984 0.0955 0.0878 0.0872 0.1478 0.1436 0.0942 0.0982 0.0794
va: 1.1221 1.9382 2.0186 2.9043 3.6485 3.7993 3.8093 3.8405 3.8685 3.9162 3.8018 3.7992 3.9432 3.8707 3.9733 4.1383 3.8413 3.9349 3.9178 3.9497 3.9321 1.0056 1.0247 1.0127 1.0003 1.0050 0.9986 0.9976 0.9975 1.0127 1.0175 0.9826 1.0075 0.9922 1.0151 1.0092 1.0085 1.0109 0.9979 1.0047 1.0027 1.0035 1.0110 1.0081 1.0054 1.0021 0.9905
dispcorr: -0.028907476 hartree
energy: -1329.027627789831
dipole: 17.62262 -18.78439 -1.16177 -10.64064 10.03554 -0.60511 -12.63077 11.66010 -0.97067
magnitude: 1.63036 au
magnitude: 4.14404 debye
