program: Orca
programVersion: 5.0.2
elementType: Cl O O N C C C C C C C C C C C C C C C C C H H H H H H H H H H H H H H H H H H H H H H H H H H
charge: 0
multiplicity: 1
keywords: wb97x-d3
keywords: def2-TZVPP
keywords: def2/J RIJCOSX
keywords: DEFGRID2
keywords: scfconv7
keywords: smallprint printgap noloewdin
keywords: NOSOSCF
formula: C17H26ClNO2
InChI: InChI=1/C17H26ClNO2/c1-4-7-11-21-13-19(16(20)12-18)17-14(5-2)9-8-10-15(17)6-3/h8-10H,4-7,11-13H2,1-3H3
47 atoms
Cl -1.37465 2.853631 2.484192
O  1.952938 -0.320504 -0.603727
O  0.613845 2.198067 0.502056
N  -0.274765 0.317255 -0.375554
C  -1.337847 -0.635548 -0.410011
C  -1.292853 -1.763261 0.418479
C  -2.408616 -0.412343 -1.286113
C  -0.155853 -2.05191 1.36192
C  -2.473878 0.780075 -2.203508
C  0.837773 0.178961 -1.285992
C  -2.349483 -2.668274 0.354531
C  -3.441564 -1.343369 -1.318872
C  4.315193 -0.517065 -0.315527
C  3.19481 0.161989 -1.077622
C  -3.415007 -2.463524 -0.504403
C  -0.275328 1.371776 0.481542
C  4.227875 -0.409186 1.20518
C  0.734242 -3.18779 0.862039
C  -2.016403 0.451156 -3.622619
C  -1.477158 1.443134 1.410377
C  4.161979 1.017144 1.731951
H  -0.571547 -2.328441 2.334162
H  0.451621 -1.164002 1.53247
H  -1.882012 1.609753 -1.815111
H  -3.506738 1.133887 -2.24024
H  1.057059 1.148328 -1.746298
H  0.531988 -0.509136 -2.078738
H  -2.33613 -3.541656 0.996294
H  -4.280489 -1.180427 -1.985357
H  5.252112 -0.06996 -0.661814
H  4.356813 -1.572424 -0.600817
H  3.244302 1.252819 -0.958006
H  3.312844 -0.043859 -2.150206
H  -4.230921 -3.17456 -0.533996
H  3.365542 -0.973563 1.570018
H  5.104751 -0.907042 1.62779
H  0.172658 -4.117567 0.75947
H  1.551623 -3.372162 1.560628
H  1.172412 -2.956418 -0.109034
H  -0.977184 0.12158 -3.647578
H  -2.100711 1.327547 -4.266665
H  -2.624888 -0.341665 -4.060601
H  -2.403376 1.518595 0.84075
H  -1.542044 0.551531 2.033453
H  5.002639 1.61629 1.374598
H  4.193031 1.03043 2.82277
H  3.244171 1.524865 1.432515
elementType: Cl O N C H
totalener: -1329.00169530 hartree
nucrepener: 1961.44005761 hartree
electener: -3290.44175291 hartree
oneelecener: -5714.48892021 hartree
twoeener: 2424.04716730 hartree
cpcmener: -0.02751855 hartree
kineticenergy: 1324.24800787 hartree
xcener: -107.418409768310 hartree
chargesum: 0.0000000
charge: -0.149253 -0.355611 -0.476316 0.001808 0.098991 -0.173180 -0.127306 -0.149474 -0.156523 0.088567 -0.075737 -0.053535 -0.138635 -0.011127 -0.195209 0.294463 -0.089837 -0.288479 -0.267324 -0.063166 -0.278212 0.095349 0.071444 0.084364 0.090551 0.118776 0.126070 0.142426 0.140858 0.073097 0.074580 0.082440 0.100638 0.155413 0.051200 0.071287 0.094566 0.097834 0.082828 0.084794 0.096119 0.087445 0.145642 0.145273 0.083677 0.091269 0.077158
qa: -0.1493 -0.3556 -0.4763 0.0018 0.0990 -0.1732 -0.1273 -0.1495 -0.1565 0.0886 -0.0757 -0.0535 -0.1386 -0.0111 -0.1952 0.2945 -0.0898 -0.2885 -0.2673 -0.0632 -0.2782 0.0953 0.0714 0.0844 0.0906 0.1188 0.1261 0.1424 0.1409 0.0731 0.0746 0.0824 0.1006 0.1554 0.0512 0.0713 0.0946 0.0978 0.0828 0.0848 0.0961 0.0874 0.1456 0.1453 0.0837 0.0913 0.0772
va: 1.1296 1.9251 2.0251 2.9372 3.6095 3.8282 3.8022 3.8491 3.8766 3.9180 3.8064 3.7870 3.9205 3.8961 3.9727 4.1162 3.8744 3.9113 3.9135 4.0074 3.9287 1.0016 1.0285 1.0119 1.0005 0.9938 0.9926 0.9967 0.9978 1.0129 1.0121 0.9908 0.9919 0.9918 1.0121 1.0099 1.0069 1.0017 1.0166 1.0080 1.0044 1.0027 1.0020 1.0045 1.0016 1.0052 1.0102
dispcorr: -0.026661592 hartree
energy: -1329.028356889677
dipole: 18.98943 -19.98649 -0.99707 -16.49509 14.64990 -1.84519 -12.49673 11.00013 -1.49660
magnitude: 2.57656 au
magnitude: 6.54911 debye
