program: Orca
programVersion: 5.0.2
elementType: Cl O O N C C C C C C C C C C C C C C C C C H H H H H H H H H H H H H H H H H H H H H H H H H H
charge: 0
multiplicity: 1
keywords: wb97x-d3
keywords: def2-TZVPP
keywords: def2/J RIJCOSX
keywords: DEFGRID2
keywords: scfconv7
keywords: smallprint printgap noloewdin
keywords: NOSOSCF
formula: C17H26ClNO2
InChI: InChI=1/C17H26ClNO2/c1-4-7-11-21-13-19(16(20)12-18)17-14(5-2)9-8-10-15(17)6-3/h8-10H,4-7,11-13H2,1-3H3
47 atoms
Cl -2.733449 2.294879 0.986345
O  2.236172 -0.12336 -0.556225
O  0.621236 2.450043 1.283977
N  0.065053 0.675248 -0.010797
C  -0.805697 -0.416684 -0.312031
C  -0.703525 -1.612038 0.410459
C  -1.694446 -0.279164 -1.390844
C  0.234635 -1.798981 1.576788
C  -1.767845 0.992088 -2.201018
C  1.241394 0.801441 -0.858487
C  -1.515032 -2.678961 0.030579
C  -2.488154 -1.370184 -1.728183
C  4.138745 -0.853263 0.686021
C  3.100292 0.234731 0.50912
C  -2.397249 -2.561837 -1.027239
C  -0.146829 1.545375 1.008317
C  4.997105 -1.141427 -0.543207
C  -0.469792 -2.242805 2.85567
C  -3.16067 1.357686 -2.696026
C  -1.426885 1.382268 1.806311
C  5.777113 0.063176 -1.049186
H  0.785838 -0.884517 1.785138
H  0.986375 -2.545429 1.304946
H  -1.099834 0.894375 -3.063494
H  -1.375461 1.826777 -1.621254
H  1.604377 1.830763 -0.807004
H  0.935619 0.600455 -1.885228
H  -1.447549 -3.617651 0.566871
H  -3.182484 -1.29811 -2.55522
H  3.642475 -1.773348 1.009535
H  4.782679 -0.54857 1.51686
H  2.547005 0.354492 1.447459
H  3.575559 1.201319 0.298041
H  -3.016748 -3.403244 -1.310873
H  5.698964 -1.938871 -0.285092
H  4.377566 -1.542644 -1.349187
H  0.250393 -2.335666 3.669639
H  -0.959817 -3.210312 2.744457
H  -1.226826 -1.521332 3.167186
H  -3.873002 1.421624 -1.872773
H  -3.551025 0.644377 -3.42207
H  -3.135107 2.330251 -3.188754
H  -1.765038 0.356803 1.917601
H  -1.285456 1.822278 2.790255
H  6.389461 0.5029 -0.258562
H  5.121535 0.847168 -1.431978
H  6.447601 -0.217434 -1.863025
elementType: Cl O N C H
totalener: -1328.99932871 hartree
nucrepener: 1969.75942881 hartree
electener: -3298.75875752 hartree
oneelecener: -5730.81831165 hartree
twoeener: 2432.05955414 hartree
cpcmener: -0.02485623 hartree
kineticenergy: 1324.25110550 hartree
xcener: -107.423134842989 hartree
chargesum: 0.0000000
charge: -0.153748 -0.366068 -0.484218 0.009396 0.075119 -0.158249 -0.087446 -0.178661 -0.194814 0.117900 -0.088512 -0.084255 -0.140037 -0.040454 -0.191272 0.287487 -0.088295 -0.253093 -0.265011 -0.054807 -0.281569 0.083221 0.096456 0.097692 0.090962 0.112165 0.122799 0.143653 0.143184 0.076515 0.072333 0.110678 0.115770 0.155298 0.068518 0.056759 0.095482 0.088008 0.080646 0.081881 0.088283 0.095365 0.137764 0.151936 0.081886 0.081423 0.091930
qa: -0.1537 -0.3661 -0.4842 0.0094 0.0751 -0.1582 -0.0874 -0.1787 -0.1948 0.1179 -0.0885 -0.0843 -0.1400 -0.0405 -0.1913 0.2875 -0.0883 -0.2531 -0.2650 -0.0548 -0.2816 0.0832 0.0965 0.0977 0.0910 0.1122 0.1228 0.1437 0.1432 0.0765 0.0723 0.1107 0.1158 0.1553 0.0685 0.0568 0.0955 0.0880 0.0806 0.0819 0.0883 0.0954 0.1378 0.1519 0.0819 0.0814 0.0919
va: 1.1261 1.9305 2.0177 2.9492 3.7512 3.8361 3.7439 3.8942 3.8711 3.9008 3.8141 3.8010 3.9209 3.8633 3.9821 4.1340 3.8618 3.9173 3.9286 3.9574 3.9365 1.0092 1.0021 0.9988 1.0102 1.0178 0.9959 0.9967 0.9973 1.0138 1.0119 0.9905 0.9892 0.9933 1.0087 1.0207 1.0045 1.0049 1.0048 1.0122 1.0012 1.0040 1.0199 1.0074 0.9998 0.9987 1.0050
dispcorr: -0.026944906 hartree
energy: -1329.026273613762
dipole: 23.17432 -23.28138 -0.10706 -13.70452 12.19839 -1.50613 -4.48223 4.40572 -0.07651
magnitude: 1.51187 au
magnitude: 3.84287 debye
