program: Orca
programVersion: 5.0.2
elementType: Cl O O N C C C C C C C C C C C C C C C C C H H H H H H H H H H H H H H H H H H H H H H H H H H
charge: 0
multiplicity: 1
keywords: wb97x-d3
keywords: def2-TZVPP
keywords: def2/J RIJCOSX
keywords: DEFGRID2
keywords: scfconv7
keywords: smallprint printgap noloewdin
keywords: NOSOSCF
formula: C17H26ClNO2
InChI: InChI=1/C17H26ClNO2/c1-4-7-11-21-13-19(16(20)12-18)17-14(5-2)9-8-10-15(17)6-3/h8-10H,4-7,11-13H2,1-3H3
47 atoms
Cl -1.585658 3.310313 1.658796
O  2.041105 -0.468927 -0.230599
O  0.71215 1.561825 1.631325
N  -0.149046 -0.232795 0.566967
C  -1.247302 -0.850155 -0.105412
C  -2.119356 -1.66036 0.634637
C  -1.427301 -0.648161 -1.479413
C  -1.951529 -1.901461 2.110814
C  -0.519814 0.213311 -2.316804
C  1.10285 -0.950178 0.68799
C  -3.176661 -2.274871 -0.028954
C  -2.500271 -1.280767 -2.10253
C  4.237868 0.245073 -0.831179
C  3.336838 -0.227012 0.289072
C  -3.366598 -2.089902 -1.388263
C  -0.224638 1.023262 1.078581
C  3.768697 1.515895 -1.53136
C  -1.285066 -3.241424 2.412764
C  0.387218 -0.607451 -3.229705
C  -1.576009 1.700081 0.912278
C  4.772979 2.009943 -2.561683
H  -2.938142 -1.885356 2.579558
H  -1.379276 -1.099342 2.577886
H  0.09139 0.865829 -1.694603
H  -1.138624 0.871654 -2.931427
H  0.889253 -2.002799 0.488114
H  1.470805 -0.870712 1.715468
H  -3.863827 -2.897297 0.5324
H  -2.659196 -1.126784 -3.163544
H  4.359859 -0.558133 -1.565134
H  5.228212 0.41213 -0.396217
H  3.753209 -1.140019 0.732628
H  3.292887 0.527602 1.084442
H  -4.198712 -2.567945 -1.889445
H  2.80948 1.337804 -2.02392
H  3.589285 2.298208 -0.787263
H  -1.204838 -3.396946 3.489431
H  -0.27951 -3.295676 1.994303
H  -1.86061 -4.071693 2.000687
H  1.010241 0.048363 -3.83952
H  -0.191807 -1.235236 -3.908354
H  1.049173 -1.257704 -2.658175
H  -1.822436 1.818733 -0.142692
H  -2.367231 1.109677 1.373577
H  5.728555 2.265267 -2.099261
H  4.410209 2.900062 -3.077944
H  4.969274 1.250304 -3.321546
elementType: Cl O N C H
totalener: -1329.00203402 hartree
nucrepener: 1944.76260090 hartree
electener: -3273.76463492 hartree
oneelecener: -5681.04797069 hartree
twoeener: 2407.28333577 hartree
cpcmener: -0.02703572 hartree
kineticenergy: 1324.25645443 hartree
xcener: -107.419116348559 hartree
chargesum: -0.0000000
charge: -0.149608 -0.360404 -0.473336 -0.000432 0.091005 -0.107588 -0.163226 -0.157206 -0.154107 0.086698 -0.060507 -0.082150 -0.118161 0.001728 -0.192132 0.288322 -0.059661 -0.267303 -0.291265 -0.064585 -0.281721 0.090561 0.084222 0.072272 0.094515 0.124779 0.119904 0.140319 0.142322 0.065959 0.066622 0.095799 0.073632 0.155186 0.043047 0.059924 0.095714 0.085782 0.087202 0.097419 0.095611 0.084001 0.145685 0.145910 0.081115 0.090377 0.077757
qa: -0.1496 -0.3604 -0.4733 -0.0004 0.0910 -0.1076 -0.1632 -0.1572 -0.1541 0.0867 -0.0605 -0.0822 -0.1182 0.0017 -0.1921 0.2883 -0.0597 -0.2673 -0.2913 -0.0646 -0.2817 0.0906 0.0842 0.0723 0.0945 0.1248 0.1199 0.1403 0.1423 0.0660 0.0666 0.0958 0.0736 0.1552 0.0430 0.0599 0.0957 0.0858 0.0872 0.0974 0.0956 0.0840 0.1457 0.1459 0.0811 0.0904 0.0778
va: 1.1294 1.9256 2.0348 2.9305 3.6301 3.7850 3.8068 3.8739 3.8483 3.9301 3.7940 3.8144 3.9041 3.9155 3.9697 4.1333 3.8584 3.9147 3.9061 4.0066 3.9505 1.0002 1.0122 1.0254 1.0019 0.9955 0.9938 0.9980 0.9967 1.0129 1.0142 0.9909 1.0018 0.9919 1.0126 1.0115 1.0043 1.0070 1.0030 1.0008 1.0079 1.0188 1.0046 1.0027 1.0014 1.0033 1.0007
dispcorr: -0.025963044 hartree
energy: -1329.027997068509
dipole: 21.00292 -21.85799 -0.85507 -16.24897 14.08471 -2.16426 -15.07298 14.38762 -0.68536
magnitude: 2.42588 au
magnitude: 6.16609 debye
