program: Orca
programVersion: 5.0.2
elementType: Cl O O N C C C C C C C C C C C C C C C C C H H H H H H H H H H H H H H H H H H H H H H H H H H
charge: 0
multiplicity: 1
keywords: wb97x-d3
keywords: def2-TZVPP
keywords: def2/J RIJCOSX
keywords: DEFGRID2
keywords: scfconv7
keywords: smallprint printgap noloewdin
keywords: NOSOSCF
formula: C17H26ClNO2
InChI: InChI=1/C17H26ClNO2/c1-4-7-11-21-13-19(16(20)12-18)17-14(5-2)9-8-10-15(17)6-3/h8-10H,4-7,11-13H2,1-3H3
47 atoms
Cl -1.716264 2.765738 0.777306
O  2.123689 -0.335354 -0.285365
O  0.624845 1.221695 2.454115
N  0.019986 -0.259747 0.848945
C  -1.018068 -0.886658 0.090986
C  -1.679686 -1.984695 0.660426
C  -1.342763 -0.421942 -1.18808
C  -1.354817 -2.519926 2.031675
C  -0.61426 0.695898 -1.885283
C  1.357062 -0.835057 0.761961
C  -2.705158 -2.58744 -0.059212
C  -2.386536 -1.048924 -1.867414
C  3.554717 1.316657 -1.261094
C  2.684528 0.950871 -0.077704
C  -3.066404 -2.116971 -1.311149
C  -0.231039 0.740289 1.733382
C  4.731172 0.379399 -1.505451
C  -2.364703 -2.087386 3.091626
C  0.206304 0.193481 -3.070758
C  -1.646019 1.289486 1.792663
C  5.61448 0.852233 -2.650317
H  -0.354187 -2.22716 2.349874
H  -1.346319 -3.611172 1.980343
H  0.029587 1.236739 -1.195348
H  -1.347471 1.421861 -2.244052
H  1.242371 -1.902515 0.575714
H  1.85833 -0.705478 1.724923
H  -3.227982 -3.43393 0.370684
H  -2.66574 -0.688976 -2.850878
H  3.92888 2.328758 -1.0777
H  2.937528 1.383642 -2.163104
H  3.278263 0.955515 0.846276
H  1.900226 1.70766 0.036099
H  -3.875467 -2.587432 -1.855339
H  5.328241 0.30122 -0.591316
H  4.369199 -0.628692 -1.721509
H  -3.377374 -2.393685 2.826003
H  -2.37202 -1.00603 3.231789
H  -2.124422 -2.539816 4.054682
H  0.733259 1.020048 -3.54977
H  -0.426337 -0.272555 -3.82784
H  0.948493 -0.541695 -2.761588
H  -2.420525 0.614917 1.443083
H  -1.862492 1.587388 2.81584
H  6.028919 1.842886 -2.452075
H  5.054174 0.913664 -3.58564
H  6.452706 0.17382 -2.815946
elementType: Cl O N C H
totalener: -1329.00153198 hartree
nucrepener: 1971.32092821 hartree
electener: -3300.32246019 hartree
oneelecener: -5733.98864132 hartree
twoeener: 2433.66618113 hartree
cpcmener: -0.02402170 hartree
kineticenergy: 1324.24877080 hartree
xcener: -107.418450764265 hartree
chargesum: 0.0000000
charge: -0.153289 -0.363488 -0.482612 0.015103 0.078472 -0.111783 -0.137172 -0.153464 -0.146003 0.095625 -0.068289 -0.089810 -0.139316 -0.010330 -0.191301 0.302889 -0.061404 -0.270393 -0.301826 -0.095279 -0.281868 0.081985 0.093364 0.059112 0.094918 0.120888 0.119907 0.141036 0.141071 0.077888 0.070793 0.101278 0.096154 0.155059 0.054850 0.054850 0.087762 0.086567 0.098218 0.097600 0.097438 0.084978 0.144586 0.157704 0.078267 0.079172 0.090094
qa: -0.1533 -0.3635 -0.4826 0.0151 0.0785 -0.1118 -0.1372 -0.1535 -0.1460 0.0956 -0.0683 -0.0898 -0.1393 -0.0103 -0.1913 0.3029 -0.0614 -0.2704 -0.3018 -0.0953 -0.2819 0.0820 0.0934 0.0591 0.0949 0.1209 0.1199 0.1410 0.1411 0.0779 0.0708 0.1013 0.0962 0.1551 0.0549 0.0548 0.0878 0.0866 0.0982 0.0976 0.0974 0.0850 0.1446 0.1577 0.0783 0.0792 0.0901
va: 1.1210 1.9393 2.0197 2.9357 3.6842 3.8840 3.8077 3.9013 3.8381 3.9087 3.8009 3.8143 3.9182 3.8917 3.9662 4.1074 3.8436 3.9171 3.9224 3.9649 3.9502 1.0063 1.0004 1.0297 1.0068 0.9945 1.0121 0.9983 0.9975 1.0140 1.0064 1.0018 0.9897 0.9921 1.0095 1.0213 1.0025 1.0030 1.0049 1.0010 1.0096 1.0166 1.0066 1.0029 1.0008 1.0003 1.0037
dispcorr: -0.027617594 hartree
energy: -1329.029149572592
dipole: 19.94465 -20.89733 -0.95268 -10.65255 9.19595 -1.45660 -11.31702 11.06377 -0.25325
magnitude: 1.75882 au
magnitude: 4.47056 debye
