program: Orca
programVersion: 5.0.2
elementType: Cl O O N C C C C C C C C C C C C C C C C C H H H H H H H H H H H H H H H H H H H H H H H H H H
charge: 0
multiplicity: 1
keywords: wb97x-d3
keywords: def2-TZVPP
keywords: def2/J RIJCOSX
keywords: DEFGRID2
keywords: scfconv7
keywords: smallprint printgap noloewdin
keywords: NOSOSCF
formula: C17H26ClNO2
InChI: InChI=1/C17H26ClNO2/c1-4-7-11-21-13-19(16(20)12-18)17-14(5-2)9-8-10-15(17)6-3/h8-10H,4-7,11-13H2,1-3H3
47 atoms
Cl -1.227444 2.943911 2.370337
O  1.896704 -0.485844 -1.245831
O  0.627944 2.367954 0.250041
N  -0.202028 0.401439 -0.511776
C  -1.235779 -0.582877 -0.448597
C  -1.097384 -1.694981 0.390397
C  -2.378998 -0.405638 -1.242257
C  0.111882 -1.937536 1.253128
C  -2.55983 0.765681 -2.171537
C  0.786791 0.288896 -1.572521
C  -2.134249 -2.624316 0.430255
C  -3.388843 -1.359218 -1.171551
C  4.073427 -0.75601 -0.306083
C  2.856292 0.14065 -0.409495
C  -3.271416 -2.460494 -0.340322
C  -0.201035 1.484068 0.312931
C  5.22097 -0.104405 0.460724
C  0.928071 -3.140961 0.787723
C  -2.433757 0.370774 -3.64128
C  -1.332201 1.508061 1.331054
C  4.885855 0.263616 1.900244
H  -0.221285 -2.112274 2.27972
H  0.750557 -1.055994 1.290073
H  -1.847239 1.560339 -1.950572
H  -3.551574 1.193227 -2.005346
H  1.079088 1.294812 -1.887278
H  0.306836 -0.207128 -2.415054
H  -2.048318 -3.483171 1.085694
H  -4.283689 -1.227638 -1.768831
H  4.416015 -1.009975 -1.31336
H  3.795979 -1.69656 0.181108
H  2.438407 0.324487 0.585648
H  3.141116 1.115356 -0.82869
H  -4.071616 -3.187972 -0.288028
H  6.070609 -0.79152 0.456392
H  5.554767 0.789447 -0.075068
H  0.341781 -4.060268 0.827532
H  1.801822 -3.282205 1.425378
H  1.276289 -3.014639 -0.23717
H  -1.449949 -0.044227 -3.863783
H  -2.580306 1.238957 -4.285217
H  -3.178117 -0.376162 -3.920173
H  -2.302258 1.522012 0.834349
H  -1.300106 0.627824 1.972107
H  4.132822 1.050872 1.960891
H  5.770214 0.626569 2.426212
H  4.506339 -0.598085 2.454057
elementType: Cl O N C H
totalener: -1329.00233921 hartree
nucrepener: 1950.12652769 hartree
electener: -3279.12886691 hartree
oneelecener: -5691.24132958 hartree
twoeener: 2412.11246268 hartree
cpcmener: -0.02664543 hartree
kineticenergy: 1324.25071252 hartree
xcener: -107.420696559462 hartree
chargesum: 0.0000000
charge: -0.150221 -0.370279 -0.468803 -0.002896 0.127009 -0.171900 -0.155567 -0.158775 -0.167555 0.106593 -0.079266 -0.059902 -0.097194 -0.009733 -0.198838 0.286556 -0.114311 -0.287802 -0.256283 -0.072214 -0.279628 0.099544 0.081324 0.083138 0.094463 0.119635 0.121071 0.141804 0.141745 0.069951 0.068084 0.082368 0.100100 0.155066 0.072118 0.059712 0.095251 0.097049 0.081840 0.084891 0.094524 0.085893 0.148721 0.145590 0.081430 0.093704 0.081991
qa: -0.1502 -0.3703 -0.4688 -0.0029 0.1270 -0.1719 -0.1556 -0.1588 -0.1676 0.1066 -0.0793 -0.0599 -0.0972 -0.0097 -0.1988 0.2866 -0.1143 -0.2878 -0.2563 -0.0722 -0.2796 0.0995 0.0813 0.0831 0.0945 0.1196 0.1211 0.1418 0.1417 0.0700 0.0681 0.0824 0.1001 0.1551 0.0721 0.0597 0.0953 0.0970 0.0818 0.0849 0.0945 0.0859 0.1487 0.1456 0.0814 0.0937 0.0820
va: 1.1289 1.9422 2.0328 2.9381 3.6143 3.8327 3.8176 3.8452 3.8752 3.9069 3.8001 3.7947 3.8866 3.8831 3.9767 4.1352 3.9096 3.9093 3.9198 4.0021 3.9296 1.0007 1.0173 1.0143 0.9997 1.0104 1.0010 0.9973 0.9973 1.0194 1.0125 0.9737 1.0021 0.9924 1.0074 1.0090 1.0083 1.0017 1.0189 1.0032 1.0048 1.0037 1.0025 1.0051 0.9988 1.0042 1.0007
dispcorr: -0.026478366 hartree
energy: -1329.028817576874
dipole: 19.18240 -20.22478 -1.04238 -17.96795 16.28138 -1.68657 -9.86083 9.22443 -0.63639
magnitude: 2.08232 au
magnitude: 5.29284 debye
