program: Orca
programVersion: 5.0.2
elementType: Cl O O N C C C C C C C C C C C C C C C C C H H H H H H H H H H H H H H H H H H H H H H H H H H
charge: 0
multiplicity: 1
keywords: wb97x-d3
keywords: def2-TZVPP
keywords: def2/J RIJCOSX
keywords: DEFGRID2
keywords: scfconv7
keywords: smallprint printgap noloewdin
keywords: NOSOSCF
formula: C17H26ClNO2
InChI: InChI=1/C17H26ClNO2/c1-4-7-11-21-13-19(16(20)12-18)17-14(5-2)9-8-10-15(17)6-3/h8-10H,4-7,11-13H2,1-3H3
47 atoms
Cl -1.13589 2.82203 0.464608
O  2.044083 -0.998345 -0.389029
O  1.137951 1.053735 2.242577
N  0.068716 -0.325683 0.796171
C  -1.149862 -0.728196 0.164641
C  -2.051767 -1.514974 0.898743
C  -1.414148 -0.363135 -1.160042
C  -1.797151 -1.953887 2.317593
C  -0.476977 0.451673 -2.011029
C  1.20806 -1.229994 0.699277
C  -3.234998 -1.914639 0.288102
C  -2.612941 -0.788622 -1.731585
C  3.815628 0.169485 -1.478803
C  2.885405 0.138465 -0.283892
C  -3.517581 -1.553894 -1.019109
C  0.132156 0.747693 1.62763
C  4.845078 1.29288 -1.388579
C  -1.358024 -3.413393 2.407012
C  0.116183 -0.354324 -3.164352
C  -1.117503 1.596914 1.772277
C  4.246043 2.69298 -1.354944
H  -2.719156 -1.827605 2.889832
H  -1.05235 -1.325918 2.806674
H  0.323122 0.880562 -1.411747
H  -1.032001 1.298334 -2.421833
H  0.813047 -2.235808 0.566777
H  1.759821 -1.19789 1.643378
H  -3.946237 -2.508452 0.850492
H  -2.839153 -0.504065 -2.752594
H  3.229829 0.282241 -2.397023
H  4.336673 -0.789502 -1.551798
H  3.468495 0.090808 0.645884
H  2.288533 1.055698 -0.248514
H  -4.446808 -1.864953 -1.479482
H  5.469747 1.142138 -0.502727
H  5.517306 1.213699 -2.246437
H  -2.108132 -4.081427 1.981558
H  -1.207118 -3.704711 3.447329
H  -0.421393 -3.587495 1.876379
H  -0.659353 -0.721574 -3.838131
H  0.678194 -1.216274 -2.805928
H  0.79349 0.26465 -3.754727
H  -2.049906 1.043026 1.719309
H  -1.069436 2.128322 2.719232
H  3.582434 2.862182 -2.205968
H  5.027906 3.452982 -1.394109
H  3.669166 2.875385 -0.447021
elementType: Cl O N C H
totalener: -1328.99985018 hartree
nucrepener: 1984.58911003 hartree
electener: -3313.58896021 hartree
oneelecener: -5760.62970160 hartree
twoeener: 2447.04074139 hartree
cpcmener: -0.02381316 hartree
kineticenergy: 1324.24892378 hartree
xcener: -107.419049802344 hartree
chargesum: 0.0000000
charge: -0.151627 -0.367406 -0.479968 0.024492 0.091688 -0.145057 -0.142752 -0.157294 -0.146693 0.098904 -0.062840 -0.087059 -0.096618 -0.007481 -0.195212 0.276012 -0.112631 -0.262355 -0.294298 -0.059423 -0.276797 0.092459 0.083918 0.062173 0.093925 0.123970 0.121803 0.140801 0.141157 0.066597 0.070808 0.099546 0.077920 0.155260 0.058331 0.071854 0.087591 0.095879 0.085873 0.094776 0.084426 0.096017 0.144810 0.149634 0.081570 0.092966 0.080352
qa: -0.1516 -0.3674 -0.4800 0.0245 0.0917 -0.1451 -0.1428 -0.1573 -0.1467 0.0989 -0.0628 -0.0871 -0.0966 -0.0075 -0.1952 0.2760 -0.1126 -0.2624 -0.2943 -0.0594 -0.2768 0.0925 0.0839 0.0622 0.0939 0.1240 0.1218 0.1408 0.1412 0.0666 0.0708 0.0995 0.0779 0.1553 0.0583 0.0719 0.0876 0.0959 0.0859 0.0948 0.0844 0.0960 0.1448 0.1496 0.0816 0.0930 0.0804
va: 1.1216 1.9426 2.0170 2.9164 3.6801 3.8148 3.7896 3.8741 3.8472 3.8938 3.8018 3.8076 3.8907 3.8936 3.9737 4.1405 3.9130 3.9183 3.9242 3.9504 3.9289 1.0001 1.0129 1.0221 1.0052 0.9985 1.0113 0.9977 0.9976 1.0132 1.0185 1.0028 0.9713 0.9920 1.0093 1.0073 1.0029 1.0046 1.0037 1.0091 1.0171 1.0013 1.0088 1.0089 1.0009 1.0041 0.9995
dispcorr: -0.027721532 hartree
energy: -1329.027571715002
dipole: 17.06300 -18.24849 -1.18549 -10.96742 9.87018 -1.09725 -8.97092 8.99646 0.02554
magnitude: 1.61555 au
magnitude: 4.10639 debye
