program: Orca
programVersion: 5.0.2
elementType: Cl O O N C C C C C C C C C C C C C C C C C H H H H H H H H H H H H H H H H H H H H H H H H H H
charge: 0
multiplicity: 1
keywords: wb97x-d3
keywords: def2-TZVPP
keywords: def2/J RIJCOSX
keywords: DEFGRID2
keywords: scfconv7
keywords: smallprint printgap noloewdin
keywords: NOSOSCF
formula: C17H26ClNO2
InChI: InChI=1/C17H26ClNO2/c1-4-7-11-21-13-19(16(20)12-18)17-14(5-2)9-8-10-15(17)6-3/h8-10H,4-7,11-13H2,1-3H3
47 atoms
Cl -0.867839 2.879659 0.403753
O  2.122816 -1.176668 -0.213872
O  0.956208 1.041346 2.270122
N  0.097183 -0.506748 0.85415
C  -1.019019 -1.022476 0.123605
C  -1.889512 -1.896226 0.788662
C  -1.198908 -0.689433 -1.225922
C  -1.721688 -2.27181 2.238222
C  -0.243118 0.206166 -1.973816
C  1.295412 -1.336491 0.89408
C  -2.972136 -2.415865 0.087158
C  -2.296626 -1.235828 -1.887874
C  3.754012 0.025483 -1.469753
C  2.904814 0.007203 -0.215415
C  -3.17774 -2.085441 -1.240939
C  0.04039 0.644196 1.572311
C  4.68374 1.23446 -1.537024
C  -2.62505 -1.463712 3.165566
C  -0.901454 1.158674 -2.96354
C  -1.224686 1.477962 1.464005
C  3.964944 2.577044 -1.581104
H  -0.686532 -2.161573 2.561641
H  -1.962085 -3.331465 2.349225
H  0.475943 -0.422202 -2.507694
H  0.343629 0.793695 -1.271571
H  0.97766 -2.378853 0.891424
H  1.82639 -1.141534 1.829549
H  -3.656002 -3.089731 0.590004
H  -2.46723 -0.997938 -2.929803
H  3.10206 0.019487 -2.349583
H  4.351039 -0.889962 -1.513095
H  3.544824 0.036484 0.677375
H  2.264694 0.894746 -0.183555
H  -4.023484 -2.496161 -1.777709
H  5.370573 1.215764 -0.685305
H  5.30894 1.136024 -2.427781
H  -2.513328 -1.801208 4.196825
H  -3.675607 -1.573005 2.892934
H  -2.386649 -0.400034 3.143657
H  -1.368569 0.64047 -3.801037
H  -0.151909 1.830357 -3.383958
H  -1.662113 1.773347 -2.481418
H  -2.0876 0.965584 1.052193
H  -1.473517 1.869803 2.44778
H  4.668925 3.391976 -1.755478
H  3.443236 2.799515 -0.649161
H  3.225938 2.605041 -2.385214
elementType: Cl O N C H
totalener: -1328.99977162 hartree
nucrepener: 1987.40042910 hartree
electener: -3316.40020072 hartree
oneelecener: -5766.06950670 hartree
twoeener: 2449.66930598 hartree
cpcmener: -0.02498871 hartree
kineticenergy: 1324.24451759 hartree
xcener: -107.420327686229 hartree
chargesum: 0.0000000
charge: -0.150951 -0.365555 -0.482812 0.010433 0.029651 -0.103221 -0.089562 -0.153211 -0.143648 0.094708 -0.082711 -0.099779 -0.109634 0.003374 -0.180605 0.290908 -0.110487 -0.270029 -0.263268 -0.090447 -0.276973 0.083437 0.091336 0.086406 0.051245 0.120348 0.119405 0.140797 0.143765 0.069018 0.073662 0.104159 0.077198 0.155661 0.058149 0.072428 0.098084 0.088634 0.085555 0.092010 0.095922 0.078350 0.144988 0.158377 0.094496 0.079538 0.080849
qa: -0.1510 -0.3656 -0.4828 0.0104 0.0297 -0.1032 -0.0896 -0.1532 -0.1436 0.0947 -0.0827 -0.0998 -0.1096 0.0034 -0.1806 0.2909 -0.1105 -0.2700 -0.2633 -0.0904 -0.2770 0.0834 0.0913 0.0864 0.0512 0.1203 0.1194 0.1408 0.1438 0.0690 0.0737 0.1042 0.0772 0.1557 0.0581 0.0724 0.0981 0.0886 0.0856 0.0920 0.0959 0.0783 0.1450 0.1584 0.0945 0.0795 0.0808
va: 1.1262 1.9518 2.0225 2.9265 3.7625 3.8814 3.8372 3.9008 3.8881 3.9232 3.8223 3.8156 3.8881 3.8826 3.9652 4.1152 3.9072 3.9152 3.9222 3.9591 3.9286 1.0053 1.0010 1.0098 1.0174 0.9928 1.0134 0.9992 0.9984 1.0131 1.0181 1.0006 0.9713 0.9925 1.0092 1.0066 1.0050 1.0023 1.0038 1.0043 1.0040 1.0146 1.0064 1.0023 1.0043 0.9998 1.0011
dispcorr: -0.027864618 hartree
energy: -1329.027636241544
dipole: 11.39363 -12.57494 -1.18131 -5.05557 3.79316 -1.26242 -7.99327 7.76247 -0.23080
magnitude: 1.74427 au
magnitude: 4.43358 debye
