program: Orca
programVersion: 5.0.2
elementType: Cl O O N C C C C C C C C C C C C C C C C C H H H H H H H H H H H H H H H H H H H H H H H H H H
charge: 0
multiplicity: 1
keywords: wb97x-d3
keywords: def2-TZVPP
keywords: def2/J RIJCOSX
keywords: DEFGRID2
keywords: scfconv7
keywords: smallprint printgap noloewdin
keywords: NOSOSCF
formula: C17H26ClNO2
InChI: InChI=1/C17H26ClNO2/c1-4-7-11-21-13-19(16(20)12-18)17-14(5-2)9-8-10-15(17)6-3/h8-10H,4-7,11-13H2,1-3H3
47 atoms
Cl -0.720262 1.482727 2.711864
O  1.89626 -0.170628 -1.352891
O  0.360051 2.688514 -0.008893
N  -0.264902 0.638019 -0.744333
C  -1.187144 -0.455068 -0.730969
C  -0.961704 -1.561877 0.097635
C  -2.27634 -0.405475 -1.61188
C  0.220317 -1.652261 1.030368
C  -2.552508 0.775624 -2.504687
C  0.793594 0.582481 -1.745813
C  -1.868301 -2.6187 0.031857
C  -3.155759 -1.482041 -1.640689
C  3.942535 -0.45817 -0.15775
C  2.779704 0.468462 -0.446209
C  -2.95414 -2.582291 -0.825457
C  -0.381195 1.724649 0.060729
C  4.924382 0.158914 0.830703
C  -0.105404 -2.22282 2.405199
C  -3.56231 1.749143 -1.901401
C  -1.483489 1.710196 1.104929
C  6.081947 -0.769311 1.165639
H  0.669296 -0.670758 1.164236
H  0.991178 -2.27019 0.560502
H  -2.947344 0.404001 -3.452658
H  -1.636231 1.313987 -2.748948
H  1.073681 1.603328 -2.018128
H  0.387316 0.091126 -2.629422
H  -1.720397 -3.490742 0.655931
H  -4.00277 -1.456889 -2.316501
H  4.460978 -0.700924 -1.090552
H  3.561186 -1.400809 0.24823
H  2.272553 0.715757 0.493501
H  3.141522 1.41167 -0.876679
H  -3.642697 -3.417157 -0.860715
H  5.315011 1.095909 0.422438
H  4.395721 0.42538 1.75092
H  0.773046 -2.164206 3.048485
H  -0.402229 -3.270817 2.365268
H  -0.906872 -1.665037 2.890177
H  -4.503126 1.250209 -1.665366
H  -3.780604 2.555522 -2.602448
H  -3.191794 2.206416 -0.98388
H  -1.973233 2.681735 1.113687
H  -2.231393 0.933735 0.982844
H  6.652943 -1.033595 0.273387
H  5.728946 -1.698538 1.617209
H  6.77257 -0.305081 1.871127
elementType: Cl O N C H
totalener: -1329.00097689 hartree
nucrepener: 1965.37675394 hartree
electener: -3294.37773083 hartree
oneelecener: -5721.96603332 hartree
twoeener: 2427.58830249 hartree
cpcmener: -0.02513877 hartree
kineticenergy: 1324.24665720 hartree
xcener: -107.419343790116 hartree
chargesum: -0.0000000
charge: -0.152383 -0.362311 -0.483471 0.011029 0.027546 -0.086691 -0.097463 -0.157719 -0.152278 0.093232 -0.098948 -0.081105 -0.101311 -0.000123 -0.179694 0.295134 -0.087712 -0.264983 -0.272417 -0.092071 -0.284022 0.060553 0.089220 0.089806 0.083599 0.119290 0.120255 0.143812 0.140136 0.068252 0.062016 0.080484 0.103107 0.155692 0.060171 0.061020 0.096157 0.092228 0.076020 0.088793 0.098415 0.086814 0.158410 0.144663 0.079038 0.079314 0.090495
qa: -0.1524 -0.3623 -0.4835 0.0110 0.0275 -0.0867 -0.0975 -0.1577 -0.1523 0.0932 -0.0989 -0.0811 -0.1013 -0.0001 -0.1797 0.2951 -0.0877 -0.2650 -0.2724 -0.0921 -0.2840 0.0606 0.0892 0.0898 0.0836 0.1193 0.1203 0.1438 0.1401 0.0683 0.0620 0.0805 0.1031 0.1557 0.0602 0.0610 0.0962 0.0922 0.0760 0.0888 0.0984 0.0868 0.1584 0.1447 0.0790 0.0793 0.0905
va: 1.1233 1.9537 2.0236 2.9222 3.7622 3.8209 3.8786 3.8808 3.9015 3.9239 3.8147 3.8224 3.8859 3.8863 3.9619 4.1106 3.8848 3.9222 3.9145 3.9638 3.9505 1.0168 1.0082 1.0013 1.0043 1.0129 0.9925 0.9986 0.9997 1.0161 1.0129 0.9828 1.0008 0.9924 1.0075 1.0059 1.0036 1.0051 1.0149 1.0020 1.0052 1.0038 1.0020 1.0062 1.0003 1.0004 1.0034
dispcorr: -0.026970359 hartree
energy: -1329.027947246250
dipole: 15.21914 -16.44735 -1.22820 -9.14668 8.17558 -0.97109 -5.63873 4.79342 -0.84531
magnitude: 1.77934 au
magnitude: 4.52272 debye
