program: Orca
programVersion: 5.0.2
elementType: Cl O O N C C C C C C C C C C C C C C C C C H H H H H H H H H H H H H H H H H H H H H H H H H H
charge: 0
multiplicity: 1
keywords: wb97x-d3
keywords: def2-TZVPP
keywords: def2/J RIJCOSX
keywords: DEFGRID2
keywords: scfconv7
keywords: smallprint printgap noloewdin
keywords: NOSOSCF
formula: C17H26ClNO2
InChI: InChI=1/C17H26ClNO2/c1-4-7-11-21-13-19(16(20)12-18)17-14(5-2)9-8-10-15(17)6-3/h8-10H,4-7,11-13H2,1-3H3
47 atoms
Cl -2.640061 2.50856 1.08663
O  2.174399 -0.220302 -0.564402
O  0.669227 2.380778 1.235391
N  0.00146 0.584005 0.024394
C  -0.97467 -0.429479 -0.232469
C  -0.931581 -1.629276 0.4989
C  -1.934822 -0.205705 -1.222981
C  0.124175 -1.855236 1.554147
C  -1.98473 1.043482 -2.063697
C  1.144303 0.661132 -0.874425
C  -1.89422 -2.593267 0.226381
C  -2.882077 -1.201331 -1.459889
C  4.189747 -0.785347 0.577891
C  3.005237 0.157077 0.520342
C  -2.864696 -2.381182 -0.743096
C  -0.147649 1.505888 1.010529
C  5.070836 -0.795576 -0.668551
C  -0.044874 -3.10578 2.401114
C  -1.642822 0.774608 -3.527381
C  -1.416057 1.440194 1.842306
C  5.693821 0.552435 -0.996757
H  0.166929 -0.990714 2.221863
H  1.100111 -1.891755 1.066321
H  -1.318544 1.811125 -1.671828
H  -2.991917 1.462511 -2.006809
H  1.492577 1.696787 -0.904799
H  0.801442 0.38583 -1.870902
H  -1.897859 -3.526325 0.773256
H  -3.643676 -1.040211 -2.213924
H  3.832455 -1.799435 0.781988
H  4.789674 -0.496011 1.446003
H  2.458899 0.10616 1.469061
H  3.337937 1.195306 0.397953
H  -3.608887 -3.143613 -0.935185
H  5.866889 -1.528349 -0.516112
H  4.499788 -1.154254 -1.527727
H  0.01653 -4.019197 1.808677
H  -0.994624 -3.114422 2.93744
H  0.75054 -3.151918 3.145238
H  -0.639508 0.360907 -3.639237
H  -1.686272 1.698808 -4.105225
H  -2.34129 0.07087 -3.981902
H  -1.855266 0.452093 1.934133
H  -1.204397 1.83202 2.833925
H  4.94576 1.296089 -1.273543
H  6.387903 0.469539 -1.834385
H  6.252919 0.949248 -0.147207
elementType: Cl O N C H
totalener: -1329.00090588 hartree
nucrepener: 1962.14067613 hartree
electener: -3291.14158201 hartree
oneelecener: -5715.49506883 hartree
twoeener: 2424.35348682 hartree
cpcmener: -0.02409947 hartree
kineticenergy: 1324.25937376 hartree
xcener: -107.424386852989 hartree
chargesum: 0.0000000
charge: -0.153272 -0.370184 -0.483751 0.021759 0.053913 -0.144416 -0.130954 -0.084968 -0.174662 0.110083 -0.083907 -0.084358 -0.136643 -0.030044 -0.194436 0.291329 -0.089069 -0.299423 -0.256007 -0.072865 -0.280720 0.076263 0.082940 0.075076 0.090649 0.113372 0.123677 0.145496 0.139979 0.077912 0.071639 0.103695 0.115305 0.154542 0.068723 0.055991 0.088116 0.093860 0.097466 0.084114 0.094508 0.085971 0.145830 0.153405 0.081865 0.091462 0.080734
qa: -0.1533 -0.3702 -0.4838 0.0218 0.0539 -0.1444 -0.1310 -0.0850 -0.1747 0.1101 -0.0839 -0.0844 -0.1366 -0.0300 -0.1944 0.2913 -0.0891 -0.2994 -0.2560 -0.0729 -0.2807 0.0763 0.0829 0.0751 0.0906 0.1134 0.1237 0.1455 0.1400 0.0779 0.0716 0.1037 0.1153 0.1545 0.0687 0.0560 0.0881 0.0939 0.0975 0.0841 0.0945 0.0860 0.1458 0.1534 0.0819 0.0915 0.0807
va: 1.1208 1.9248 2.0193 2.9553 3.7554 3.8527 3.7646 3.8834 3.8845 3.9228 3.7791 3.8179 3.9329 3.8453 4.0031 4.1317 3.8614 3.9668 3.9291 3.9617 3.9368 1.0006 1.0124 1.0158 1.0032 1.0134 0.9987 0.9983 0.9982 1.0112 1.0119 0.9920 0.9949 0.9935 1.0091 1.0216 0.9959 0.9984 1.0034 1.0035 1.0046 1.0044 1.0091 1.0062 0.9983 1.0048 1.0005
dispcorr: -0.026540422 hartree
energy: -1329.027446298887
dipole: 26.08610 -26.39866 -0.31256 -15.63550 14.12450 -1.51100 -7.33247 7.27684 -0.05563
magnitude: 1.54399 au
magnitude: 3.92450 debye
