program: Orca
programVersion: 5.0.2
elementType: Cl O O N C C C C C C C C C C C C C C C C C H H H H H H H H H H H H H H H H H H H H H H H H H H
charge: 0
multiplicity: 1
keywords: wb97x-d3
keywords: def2-TZVPP
keywords: def2/J RIJCOSX
keywords: DEFGRID2
keywords: scfconv7
keywords: smallprint printgap noloewdin
keywords: NOSOSCF
formula: C17H26ClNO2
InChI: InChI=1/C17H26ClNO2/c1-4-7-11-21-13-19(16(20)12-18)17-14(5-2)9-8-10-15(17)6-3/h8-10H,4-7,11-13H2,1-3H3
47 atoms
Cl -2.475388 2.297676 1.335246
O  1.994744 -0.291679 -1.204086
O  0.860993 2.356159 0.795769
N  -0.026006 0.557695 -0.2600
C  -1.038919 -0.447402 -0.344114
C  -0.870981 -1.669694 0.321168
C  -2.164442 -0.196131 -1.141551
C  0.323054 -1.978362 1.188589
C  -2.363619 1.079634 -1.918637
C  0.941292 0.608607 -1.3485
C  -1.862169 -2.637145 0.175933
C  -3.13621 -1.187106 -1.243492
C  4.113022 -0.937059 -0.323356
C  3.020848 0.112533 -0.31167
C  -2.988005 -2.399347 -0.593241
C  0.02763 1.468877 0.744824
C  5.22232 -0.642327 0.682381
C  -0.049544 -2.424548 2.59876
C  -2.297976 0.8609 -3.427983
C  -1.025793 1.372299 1.83344
C  6.013755 0.623498 0.384689
H  0.979224 -1.113741 1.26252
H  0.91377 -2.763013 0.707511
H  -1.633933 1.8361 -1.632451
H  -3.341148 1.494757 -1.662809
H  1.295339 1.636964 -1.457249
H  0.423395 0.327975 -2.264657
H  -1.750313 -3.593638 0.67192
H  -4.020235 -1.002748 -1.842941
H  4.538489 -1.018354 -1.328664
H  3.66882 -1.909218 -0.089643
H  2.638449 0.221316 0.710603
H  3.410029 1.091914 -0.616877
H  -3.75067 -3.162196 -0.687072
H  4.794644 -0.580093 1.687856
H  5.906667 -1.493914 0.701223
H  -0.629588 -3.347651 2.604802
H  -0.633552 -1.661894 3.116809
H  0.851237 -2.606113 3.186711
H  -2.450393 1.802669 -3.957191
H  -3.065264 0.165145 -3.770075
H  -1.330531 0.461244 -3.735501
H  -1.341632 0.358768 2.063812
H  -0.63417 1.836303 2.735214
H  6.434725 0.598793 -0.622854
H  6.844461 0.739606 1.082538
H  5.402088 1.523565 0.463316
elementType: Cl O N C H
totalener: -1328.99976511 hartree
nucrepener: 1962.71316239 hartree
electener: -3291.71292750 hartree
oneelecener: -5716.61330583 hartree
twoeener: 2424.90037833 hartree
cpcmener: -0.02531035 hartree
kineticenergy: 1324.24683556 hartree
xcener: -107.420050760371 hartree
chargesum: 0.0000000
charge: -0.153101 -0.368669 -0.483182 0.010982 0.098910 -0.141959 -0.145314 -0.174738 -0.169778 0.107705 -0.079543 -0.079408 -0.096511 -0.028453 -0.194239 0.289192 -0.116846 -0.254446 -0.256418 -0.050863 -0.275653 0.079292 0.097794 0.075930 0.090556 0.117983 0.126203 0.143774 0.140479 0.069638 0.073832 0.086994 0.108640 0.154759 0.058607 0.072992 0.086983 0.080711 0.094876 0.093836 0.085207 0.083900 0.135605 0.150702 0.080093 0.091441 0.081506
qa: -0.1531 -0.3687 -0.4832 0.0110 0.0989 -0.1420 -0.1453 -0.1747 -0.1698 0.1077 -0.0795 -0.0794 -0.0965 -0.0285 -0.1942 0.2892 -0.1168 -0.2544 -0.2564 -0.0509 -0.2757 0.0793 0.0978 0.0759 0.0906 0.1180 0.1262 0.1438 0.1405 0.0696 0.0738 0.0870 0.1086 0.1548 0.0586 0.0730 0.0870 0.0807 0.0949 0.0938 0.0852 0.0839 0.1356 0.1507 0.0801 0.0914 0.0815
va: 1.1233 1.9511 2.0182 2.9409 3.6818 3.8429 3.7673 3.8934 3.8835 3.9100 3.7913 3.8153 3.8673 3.8954 3.9713 4.1376 3.9097 3.9203 3.9324 3.9606 3.9328 1.0102 1.0026 1.0155 1.0023 1.0132 0.9979 0.9967 0.9984 1.0158 1.0168 0.9773 0.9958 0.9927 1.0076 1.0065 1.0051 1.0038 1.0048 1.0049 1.0046 1.0034 1.0194 1.0073 1.0011 1.0035 0.9991
dispcorr: -0.026684159 hartree
energy: -1329.026449270898
dipole: 25.15913 -25.41198 -0.25285 -13.41312 11.94730 -1.46582 -4.43830 4.48647 0.04817
magnitude: 1.48824 au
magnitude: 3.78282 debye
