program: Orca
programVersion: 5.0.2
elementType: Cl O O N C C C C C C C C C C C C C C C C C H H H H H H H H H H H H H H H H H H H H H H H H H H
charge: 0
multiplicity: 1
keywords: wb97x-d3
keywords: def2-TZVPP
keywords: def2/J RIJCOSX
keywords: DEFGRID2
keywords: scfconv7
keywords: smallprint printgap noloewdin
keywords: NOSOSCF
formula: C17H26ClNO2
InChI: InChI=1/C17H26ClNO2/c1-4-7-11-21-13-19(16(20)12-18)17-14(5-2)9-8-10-15(17)6-3/h8-10H,4-7,11-13H2,1-3H3
47 atoms
Cl -1.743208 2.805737 0.894723
O  2.081871 -0.236803 -0.579801
O  0.785032 1.313134 2.235263
N  0.078008 -0.224139 0.728951
C  -0.99738 -0.882575 0.054015
C  -1.556909 -2.020232 0.654736
C  -1.45651 -0.410685 -1.180443
C  -1.09285 -2.555153 1.984272
C  -0.848639 0.755432 -1.913052
C  1.421998 -0.755029 0.528663
C  -2.609593 -2.660845 0.011822
C  -2.523399 -1.076764 -1.782471
C  3.412375 1.420151 -1.671256
C  2.613651 1.069803 -0.432336
C  -3.09948 -2.187696 -1.194786
C  -0.121152 0.784995 1.616197
C  4.571781 0.479729 -1.987474
C  -1.995056 -2.128004 3.139308
C  -0.106552 0.314747 -3.172826
C  -1.542741 1.280839 1.816647
C  5.62185 0.400197 -0.888303
H  -0.067396 -2.254878 2.199881
H  -1.083616 -3.646167 1.931525
H  -0.177256 1.320489 -1.270282
H  -1.646432 1.446067 -2.195941
H  1.326855 -1.82614 0.352669
H  1.997716 -0.6057 1.446022
H  -3.052169 -3.539248 0.467123
H  -2.904546 -0.713187 -2.729725
H  3.794483 2.435583 -1.527893
H  2.737268 1.470811 -2.530768
H  3.241938 1.121058 0.465718
H  1.81414 1.808437 -0.305827
H  -3.927198 -2.690076 -1.679182
H  4.192175 -0.521754 -2.205245
H  5.046364 0.82344 -2.910277
H  -3.028219 -2.435474 2.971297
H  -1.990151 -1.046884 3.28195
H  -1.661418 -2.582314 4.073126
H  0.707087 -0.370689 -2.938477
H  0.319098 1.176379 -3.689289
H  -0.772713 -0.189756 -3.874204
H  -2.322345 0.597845 1.495963
H  -1.682677 1.517253 2.869225
H  6.475017 -0.201779 -1.204926
H  5.230728 -0.05272 0.024365
H  6.000661 1.39131 -0.627522
elementType: Cl O N C H
totalener: -1329.00098345 hartree
nucrepener: 1978.61677049 hartree
electener: -3307.61775394 hartree
oneelecener: -5748.58833395 hartree
twoeener: 2440.97058001 hartree
cpcmener: -0.02419678 hartree
kineticenergy: 1324.24691546 hartree
xcener: -107.419442078158 hartree
chargesum: 0.0000000
charge: -0.154410 -0.363936 -0.483637 0.017407 0.077274 -0.109329 -0.132850 -0.154419 -0.148357 0.100527 -0.069409 -0.088858 -0.146711 -0.022786 -0.190392 0.304404 -0.090189 -0.272516 -0.298764 -0.098084 -0.281414 0.083230 0.092033 0.057173 0.095685 0.119535 0.118495 0.140502 0.140361 0.078867 0.081881 0.108078 0.099415 0.154915 0.056956 0.069518 0.088384 0.086820 0.098204 0.083685 0.097626 0.096624 0.145151 0.158581 0.091697 0.082169 0.080863
qa: -0.1544 -0.3639 -0.4836 0.0174 0.0773 -0.1093 -0.1329 -0.1544 -0.1484 0.1005 -0.0694 -0.0889 -0.1467 -0.0228 -0.1904 0.3044 -0.0902 -0.2725 -0.2988 -0.0981 -0.2814 0.0832 0.0920 0.0572 0.0957 0.1195 0.1185 0.1405 0.1404 0.0789 0.0819 0.1081 0.0994 0.1549 0.0570 0.0695 0.0884 0.0868 0.0982 0.0837 0.0976 0.0966 0.1452 0.1586 0.0917 0.0822 0.0809
va: 1.1191 1.9320 2.0204 2.9391 3.6820 3.8840 3.8123 3.9054 3.8410 3.9123 3.8018 3.8148 3.9224 3.8603 3.9644 4.1036 3.8628 3.9169 3.9206 3.9710 3.9363 1.0051 1.0006 1.0299 1.0069 0.9938 1.0119 0.9986 0.9978 1.0126 1.0099 0.9956 0.9927 0.9921 1.0197 1.0091 1.0021 1.0032 1.0051 1.0177 1.0014 1.0093 1.0063 1.0020 1.0049 0.9986 1.0002
dispcorr: -0.027954629 hartree
energy: -1329.028938082205
dipole: 19.78966 -20.72233 -0.93266 -11.42740 9.90066 -1.52674 -9.31356 9.08649 -0.22708
magnitude: 1.80343 au
magnitude: 4.58397 debye
