program: Orca
programVersion: 5.0.2
elementType: Cl O O N C C C C C C C C C C C C C C C C C H H H H H H H H H H H H H H H H H H H H H H H H H H
charge: 0
multiplicity: 1
keywords: wb97x-d3
keywords: def2-TZVPP
keywords: def2/J RIJCOSX
keywords: DEFGRID2
keywords: scfconv7
keywords: smallprint printgap noloewdin
keywords: NOSOSCF
formula: C17H26ClNO2
InChI: InChI=1/C17H26ClNO2/c1-4-7-11-21-13-19(16(20)12-18)17-14(5-2)9-8-10-15(17)6-3/h8-10H,4-7,11-13H2,1-3H3
47 atoms
Cl -1.850615 2.694502 2.743183
O  1.944928 0.118142 -0.574234
O  0.308689 2.484251 0.850498
N  -0.295803 0.617061 -0.270397
C  -1.177186 -0.49724 -0.422701
C  -1.007797 -1.641348 0.368174
C  -2.188459 -0.422005 -1.390926
C  0.0590 -1.776404 1.423793
C  -2.39989 0.789798 -2.25966
C  0.829795 0.729346 -1.158307
C  -1.872456 -2.714576 0.165543
C  -3.024353 -1.520426 -1.563211
C  4.222082 -0.581521 -0.771451
C  3.127133 0.305289 -1.324898
C  -2.868819 -2.660699 -0.793312
C  -0.464607 1.563809 0.693521
C  4.589119 -0.302774 0.681863
C  1.11926 -2.809579 1.053406
C  -1.994245 0.548854 -3.712136
C  -1.71219 1.391399 1.544943
C  5.713034 -1.203956 1.171744
H  -0.416405 -2.076164 2.361082
H  0.543866 -0.822052 1.623157
H  -1.85771 1.651335 -1.869621
H  -3.458814 1.058334 -2.230269
H  1.023349 1.785461 -1.373375
H  0.571576 0.238501 -2.102577
H  -1.761509 -3.604205 0.774601
H  -3.813151 -1.474561 -2.305282
H  5.10438 -0.441757 -1.403468
H  3.929628 -1.630462 -0.886737
H  3.433937 1.360012 -1.290835
H  2.954912 0.058349 -2.381014
H  -3.531566 -3.505172 -0.934719
H  4.885257 0.745617 0.786633
H  3.714056 -0.438871 1.322467
H  1.880805 -2.872629 1.831499
H  1.617154 -2.550315 0.120033
H  0.687146 -3.803123 0.935073
H  -0.939817 0.283364 -3.798425
H  -2.160289 1.445584 -4.310477
H  -2.57559 -0.258389 -4.160142
H  -2.607349 1.404109 0.922888
H  -1.695834 0.444842 2.08359
H  6.623669 -1.062521 0.585806
H  5.436591 -2.258048 1.097929
H  5.960666 -1.003974 2.215393
elementType: Cl O N C H
totalener: -1329.00283700 hartree
nucrepener: 1934.81744159 hartree
electener: -3263.82027859 hartree
oneelecener: -5661.00660619 hartree
twoeener: 2397.18632760 hartree
cpcmener: -0.02878241 hartree
kineticenergy: 1324.25955395 hartree
xcener: -107.419766081328 hartree
chargesum: 0.0000000
charge: -0.148693 -0.352468 -0.467686 -0.030610 0.128577 -0.172378 -0.121844 -0.161480 -0.176124 0.112612 -0.082228 -0.060995 -0.148670 0.008789 -0.195336 0.292596 -0.071505 -0.286018 -0.256644 -0.071055 -0.278599 0.097981 0.078347 0.083713 0.095379 0.104524 0.124276 0.141647 0.141008 0.079322 0.069959 0.084600 0.087236 0.155285 0.062975 0.056121 0.098363 0.077206 0.096088 0.082861 0.094810 0.085559 0.148399 0.145986 0.079495 0.078501 0.090119
qa: -0.1487 -0.3525 -0.4677 -0.0306 0.1286 -0.1724 -0.1218 -0.1615 -0.1761 0.1126 -0.0822 -0.0610 -0.1487 0.0088 -0.1953 0.2926 -0.0715 -0.2860 -0.2566 -0.0711 -0.2786 0.0980 0.0783 0.0837 0.0954 0.1045 0.1243 0.1416 0.1410 0.0793 0.0700 0.0846 0.0872 0.1553 0.0630 0.0561 0.0984 0.0772 0.0961 0.0829 0.0948 0.0856 0.1484 0.1460 0.0795 0.0785 0.0901
va: 1.1294 1.9463 2.0428 3.0084 3.6069 3.7988 3.8060 3.8541 3.8935 3.9160 3.8138 3.7824 3.9303 3.9137 3.9759 4.1366 3.8448 3.9129 3.9147 4.0088 3.9454 0.9996 1.0246 1.0138 0.9998 1.0012 0.9859 0.9969 0.9979 1.0149 1.0066 0.9953 0.9914 0.9923 1.0104 1.0146 1.0019 1.0189 1.0078 1.0059 1.0047 1.0037 1.0012 1.0052 1.0011 1.0007 1.0040
dispcorr: -0.025383611 hartree
energy: -1329.028220611666
dipole: 24.50185 -25.18899 -0.68715 -19.72648 17.79839 -1.92809 -16.02638 14.17982 -1.84656
magnitude: 2.75672 au
magnitude: 7.00702 debye
