program: Orca
programVersion: 5.0.2
elementType: Cl O O N C C C C C C C C C C C C C C C C C H H H H H H H H H H H H H H H H H H H H H H H H H H
charge: 0
multiplicity: 1
keywords: wb97x-d3
keywords: def2-TZVPP
keywords: def2/J RIJCOSX
keywords: DEFGRID2
keywords: scfconv7
keywords: smallprint printgap noloewdin
keywords: NOSOSCF
formula: C17H26ClNO2
InChI: InChI=1/C17H26ClNO2/c1-4-7-11-21-13-19(16(20)12-18)17-14(5-2)9-8-10-15(17)6-3/h8-10H,4-7,11-13H2,1-3H3
47 atoms
Cl -2.880592 1.639208 2.187875
O  2.266582 0.458709 0.131152
O  0.134847 2.532106 1.518313
N  0.026082 0.420955 0.710152
C  -0.635095 -0.572786 -0.076561
C  -1.236653 -1.656998 0.578978
C  -0.613584 -0.478291 -1.474326
C  -1.27422 -1.771608 2.082765
C  -0.027159 0.688583 -2.226789
C  1.366584 0.119986 1.146112
C  -1.802524 -2.662514 -0.19873
C  -1.196549 -1.507408 -2.209604
C  4.468205 0.388019 -0.782116
C  3.610608 0.152564 0.444144
C  -1.77956 -2.592891 -1.581539
C  -0.499449 1.643404 0.981968
C  4.161685 -0.548635 -1.945674
C  -2.654464 -2.106718 2.638147
C  -1.088757 1.513171 -2.950947
C  -1.966701 1.854166 0.659721
C  5.015682 -0.254639 -3.169752
H  -0.92964 -0.84606 2.542249
H  -0.565353 -2.543756 2.396639
H  0.68204 0.303126 -2.964324
H  0.547884 1.338153 -1.571299
H  1.421252 -0.951993 1.368274
H  1.577761 0.663116 2.072456
H  -2.26204 -3.517621 0.280947
H  -1.18289 -1.457242 -3.292125
H  5.512548 0.265482 -0.481131
H  4.363236 1.430095 -1.10009
H  3.700489 -0.893178 0.771136
H  3.958919 0.778293 1.276558
H  -2.216656 -3.389308 -2.170428
H  4.322961 -1.582575 -1.626007
H  3.105994 -0.47511 -2.218094
H  -2.999339 -3.093496 2.329881
H  -3.39775 -1.376908 2.317985
H  -2.631475 -2.100304 3.728412
H  -1.812956 1.940071 -2.256136
H  -1.6402 0.914793 -3.676992
H  -0.6250 2.338903 -3.492045
H  -2.120153 2.876133 0.323395
H  -2.38464 1.167209 -0.067322
H  4.840119 0.755888 -3.542437
H  4.796397 -0.946063 -3.984173
H  6.080165 -0.340251 -2.944468
elementType: Cl O N C H
totalener: -1328.99975047 hartree
nucrepener: 1954.66001023 hartree
electener: -3283.65976070 hartree
oneelecener: -5700.76897985 hartree
twoeener: 2417.10921915 hartree
cpcmener: -0.02629612 hartree
kineticenergy: 1324.26167716 hartree
xcener: -107.419912323106 hartree
chargesum: 0.0000000
charge: -0.152832 -0.351376 -0.481690 -0.029971 0.113295 -0.056256 -0.167477 -0.196063 -0.189531 0.112340 -0.079777 -0.077813 -0.115521 -0.003227 -0.193099 0.324832 -0.062555 -0.260604 -0.259883 -0.096252 -0.279162 0.079555 0.100178 0.095475 0.082559 0.123385 0.102978 0.141911 0.142836 0.068782 0.063667 0.078467 0.095288 0.155975 0.057118 0.045554 0.089258 0.073485 0.095587 0.084764 0.085297 0.095524 0.155793 0.140920 0.079955 0.089283 0.079028
qa: -0.1528 -0.3514 -0.4817 -0.0300 0.1133 -0.0563 -0.1675 -0.1961 -0.1895 0.1123 -0.0798 -0.0778 -0.1155 -0.0032 -0.1931 0.3248 -0.0626 -0.2606 -0.2599 -0.0963 -0.2792 0.0796 0.1002 0.0955 0.0826 0.1234 0.1030 0.1419 0.1428 0.0688 0.0637 0.0785 0.0953 0.1560 0.0571 0.0456 0.0893 0.0735 0.0956 0.0848 0.0853 0.0955 0.1558 0.1409 0.0800 0.0893 0.0790
va: 1.1250 1.9501 2.0351 3.0176 3.6530 3.7569 3.8289 3.8675 3.8762 3.9059 3.8037 3.8078 3.9139 3.9284 3.9758 4.0902 3.8581 3.9234 3.9294 3.9760 3.9466 1.0189 0.9987 0.9970 1.0307 0.9841 1.0045 0.9987 0.9968 1.0141 1.0157 0.9905 0.9966 0.9923 1.0111 1.0144 1.0047 1.0184 1.0044 1.0044 1.0040 1.0048 1.0036 1.0104 1.0010 1.0038 1.0009
dispcorr: -0.025886395 hartree
energy: -1329.025636865099
dipole: 22.56291 -22.33303 0.22988 -11.05540 9.17741 -1.87799 -17.95115 16.90053 -1.05062
magnitude: 2.16414 au
magnitude: 5.50081 debye
