program: Orca
programVersion: 5.0.2
elementType: Cl O O N C C C C C C C C C C C C C C C C C H H H H H H H H H H H H H H H H H H H H H H H H H H
charge: 0
multiplicity: 1
keywords: wb97x-d3
keywords: def2-TZVPP
keywords: def2/J RIJCOSX
keywords: DEFGRID2
keywords: scfconv7
keywords: smallprint printgap noloewdin
keywords: NOSOSCF
formula: C17H26ClNO2
InChI: InChI=1/C17H26ClNO2/c1-4-7-11-21-13-19(16(20)12-18)17-14(5-2)9-8-10-15(17)6-3/h8-10H,4-7,11-13H2,1-3H3
47 atoms
Cl -2.927318 1.598258 2.191401
O  2.253845 0.508908 0.119038
O  0.059509 2.588973 1.527461
N  0.019169 0.474267 0.720122
C  -0.605368 -0.538204 -0.072198
C  -1.166516 -1.64747 0.576759
C  -0.582773 -0.436337 -1.469402
C  -1.211786 -1.765896 2.079941
C  -0.043493 0.758405 -2.213663
C  1.366506 0.209262 1.157363
C  -1.685066 -2.673274 -0.207447
C  -1.118486 -1.486104 -2.211439
C  4.4417 0.359352 -0.820933
C  3.600452 0.211131 0.429663
C  -1.657033 -2.598097 -1.589897
C  -0.544501 1.680046 0.989991
C  4.108664 -0.650499 -1.913448
C  -2.585061 -2.147202 2.622282
C  -1.135789 1.536832 -2.942947
C  -2.017223 1.843308 0.665376
C  4.953304 -0.457038 -3.163199
H  -0.902466 -0.830014 2.54337
H  -0.480601 -2.514499 2.399283
H  0.688207 0.408414 -2.946858
H  0.496892 1.431342 -1.552151
H  1.437509 -0.850647 1.428403
H  1.578348 0.79735 2.055256
H  -2.11158 -3.548272 0.267009
H  -1.102551 -1.431245 -3.293716
H  5.489333 0.246815 -0.527287
H  4.341597 1.379088 -1.206103
H  3.68646 -0.813352 0.819051
H  3.966406 0.883462 1.217005
H  -2.056727 -3.410384 -2.183712
H  4.257729 -1.662012 -1.523716
H  3.05107 -0.579695 -2.179449
H  -2.893579 -3.144667 2.309875
H  -3.349317 -1.44224 2.295698
H  -2.572551 -2.141046 3.712784
H  -1.654402 0.916873 -3.67503
H  -0.705554 2.384408 -3.478038
H  -1.8835 1.928742 -2.252515
H  -2.202853 2.860176 0.329465
H  -2.411653 1.143782 -0.06322
H  4.791706 0.528678 -3.602838
H  4.711867 -1.198507 -3.925876
H  6.018741 -0.54715 -2.943855
elementType: Cl O N C H
totalener: -1328.99962306 hartree
nucrepener: 1956.75306506 hartree
electener: -3285.75268812 hartree
oneelecener: -5704.93899970 hartree
twoeener: 2419.18631158 hartree
cpcmener: -0.02617609 hartree
kineticenergy: 1324.26338965 hartree
xcener: -107.420324076968 hartree
chargesum: -0.0000000
charge: -0.152939 -0.350985 -0.481935 -0.030752 0.128710 -0.062024 -0.181681 -0.197346 -0.181336 0.108597 -0.078048 -0.075500 -0.114749 -0.001742 -0.194509 0.324116 -0.062169 -0.261102 -0.259752 -0.096533 -0.279489 0.079849 0.100186 0.094358 0.081998 0.124791 0.102597 0.141832 0.142655 0.068588 0.064111 0.077867 0.095127 0.156075 0.057913 0.044366 0.089143 0.073585 0.095534 0.085595 0.095672 0.084644 0.155858 0.140984 0.079597 0.089131 0.079109
qa: -0.1529 -0.3510 -0.4819 -0.0308 0.1287 -0.0620 -0.1817 -0.1973 -0.1813 0.1086 -0.0780 -0.0755 -0.1147 -0.0017 -0.1945 0.3241 -0.0622 -0.2611 -0.2598 -0.0965 -0.2795 0.0798 0.1002 0.0944 0.0820 0.1248 0.1026 0.1418 0.1427 0.0686 0.0641 0.0779 0.0951 0.1561 0.0579 0.0444 0.0891 0.0736 0.0955 0.0856 0.0957 0.0846 0.1559 0.1410 0.0796 0.0891 0.0791
va: 1.1248 1.9506 2.0352 3.0198 3.6293 3.7566 3.8349 3.8663 3.8791 3.9075 3.8014 3.8058 3.9121 3.9255 3.9766 4.0899 3.8581 3.9236 3.9289 3.9756 3.9475 1.0190 0.9986 0.9974 1.0300 0.9831 1.0064 0.9987 0.9969 1.0142 1.0156 0.9906 0.9967 0.9923 1.0108 1.0137 1.0048 1.0181 1.0044 1.0039 1.0048 1.0045 1.0036 1.0106 1.0009 1.0037 1.0009
dispcorr: -0.025952722 hartree
energy: -1329.025575780223
dipole: 22.65926 -22.36947 0.28979 -11.46396 9.60264 -1.86132 -17.97114 16.92791 -1.04323
magnitude: 2.15333 au
magnitude: 5.47332 debye
