program: Orca
programVersion: 5.0.2
elementType: Cl O O N C C C C C C C C C C C C C C C C C H H H H H H H H H H H H H H H H H H H H H H H H H H
charge: 0
multiplicity: 1
keywords: wb97x-d3
keywords: def2-TZVPP
keywords: def2/J RIJCOSX
keywords: DEFGRID2
keywords: scfconv7
keywords: smallprint printgap noloewdin
keywords: NOSOSCF
formula: C17H26ClNO2
InChI: InChI=1/C17H26ClNO2/c1-4-7-11-21-13-19(16(20)12-18)17-14(5-2)9-8-10-15(17)6-3/h8-10H,4-7,11-13H2,1-3H3
47 atoms
Cl -2.801344 1.634104 1.86759
O  2.318679 -0.450879 0.272902
O  0.546934 2.099541 1.864766
N  0.066431 0.172713 0.771616
C  -0.845073 -0.601356 -0.010171
C  -1.717862 -1.473899 0.654076
C  -0.824947 -0.507666 -1.40808
C  -1.724926 -1.655168 2.149836
C  0.11052 0.404952 -2.159828
C  1.288932 -0.488309 1.209097
C  -2.599612 -2.232316 -0.109471
C  -1.717753 -1.294639 -2.131118
C  4.296126 0.556573 -0.629765
C  3.083636 0.744101 0.256628
C  -2.603588 -2.143978 -1.490787
C  -0.201672 1.445195 1.161079
C  3.978359 0.356573 -2.107047
C  -1.224684 -3.035518 2.569247
C  -0.604215 1.398251 -3.07104
C  -1.512456 2.053597 0.696261
C  5.234568 0.257784 -2.95881
H  -2.745733 -1.521888 2.514946
H  -1.128308 -0.889829 2.644495
H  0.78358 -0.210614 -2.762946
H  0.746664 0.957954 -1.472371
H  1.054855 -1.540216 1.36489
H  1.596703 -0.06078 2.166971
H  -3.292675 -2.900032 0.389195
H  -1.717723 -1.242121 -3.213228
H  4.896214 -0.280132 -0.256921
H  4.916068 1.450916 -0.513815
H  3.404307 0.992884 1.276008
H  2.488548 1.58901 -0.111439
H  -3.295957 -2.741574 -2.07025
H  3.376693 -0.545321 -2.244031
H  3.364483 1.191739 -2.459287
H  -0.203744 -3.215521 2.229158
H  -1.851119 -3.831523 2.164814
H  -1.233105 -3.131342 3.655891
H  0.123627 2.01871 -3.595902
H  -1.256177 2.064498 -2.503948
H  -1.213766 0.902738 -3.827161
H  -1.41268 3.135883 0.692533
H  -1.839207 1.721993 -0.284178
H  5.846666 -0.598547 -2.66805
H  5.853918 1.151471 -2.859467
H  4.992625 0.142379 -4.016285
elementType: Cl O N C H
totalener: -1329.00032927 hartree
nucrepener: 1972.65969325 hartree
electener: -3301.66002251 hartree
oneelecener: -5736.53813242 hartree
twoeener: 2434.87810991 hartree
cpcmener: -0.02490785 hartree
kineticenergy: 1324.25753255 hartree
xcener: -107.421190329966 hartree
chargesum: 0.0000000
charge: -0.153987 -0.364363 -0.484220 0.015745 0.108055 -0.153711 -0.134349 -0.163893 -0.193530 0.106016 -0.076850 -0.077605 -0.110113 -0.022935 -0.197445 0.297568 -0.071314 -0.258196 -0.254443 -0.056213 -0.283364 0.089844 0.075288 0.099477 0.078490 0.124646 0.117056 0.141260 0.143657 0.064097 0.065248 0.108069 0.088400 0.154525 0.058131 0.055001 0.084154 0.086038 0.094107 0.095865 0.081215 0.086850 0.151388 0.136831 0.081002 0.078397 0.090111
qa: -0.1540 -0.3644 -0.4842 0.0157 0.1081 -0.1537 -0.1343 -0.1639 -0.1935 0.1060 -0.0768 -0.0776 -0.1101 -0.0229 -0.1974 0.2976 -0.0713 -0.2582 -0.2544 -0.0562 -0.2834 0.0898 0.0753 0.0995 0.0785 0.1246 0.1171 0.1413 0.1437 0.0641 0.0652 0.1081 0.0884 0.1545 0.0581 0.0550 0.0842 0.0860 0.0941 0.0959 0.0812 0.0869 0.1514 0.1368 0.0810 0.0784 0.0901
va: 1.1234 1.9473 2.0169 2.9446 3.6705 3.7715 3.8324 3.8852 3.9022 3.9121 3.8157 3.7919 3.9103 3.9086 3.9757 4.1253 3.8389 3.9317 3.9219 3.9641 3.9571 1.0025 1.0159 0.9977 1.0080 1.0007 1.0122 0.9980 0.9964 1.0183 1.0126 1.0025 0.9837 0.9928 1.0168 1.0070 1.0035 1.0044 1.0048 1.0049 1.0041 1.0050 1.0073 1.0181 1.0000 1.0004 1.0033
dispcorr: -0.027252665 hartree
energy: -1329.027581932466
dipole: 24.76268 -24.96822 -0.20555 -7.71555 7.00181 -0.71373 -17.75237 16.51164 -1.24073
magnitude: 1.44606 au
magnitude: 3.67558 debye
