program: Orca
programVersion: 5.0.2
elementType: Cl O O N C C C C C C C C C C C C C C C C C H H H H H H H H H H H H H H H H H H H H H H H H H H
charge: 0
multiplicity: 1
keywords: wb97x-d3
keywords: def2-TZVPP
keywords: def2/J RIJCOSX
keywords: DEFGRID2
keywords: scfconv7
keywords: smallprint printgap noloewdin
keywords: NOSOSCF
formula: C17H26ClNO2
InChI: InChI=1/C17H26ClNO2/c1-4-7-11-21-13-19(16(20)12-18)17-14(5-2)9-8-10-15(17)6-3/h8-10H,4-7,11-13H2,1-3H3
47 atoms
Cl -1.667286 2.704619 0.198333
O  2.24781 -0.407245 0.075507
O  0.624272 1.452838 2.439634
N  0.01516 -0.113965 0.917313
C  -1.026393 -0.731112 0.160598
C  -1.885375 -1.630221 0.811955
C  -1.173666 -0.449977 -1.200873
C  -1.740902 -1.997429 2.266879
C  -0.251449 0.452628 -1.973672
C  1.300675 -0.795296 1.008894
C  -2.909628 -2.222029 0.084143
C  -2.217455 -1.063584 -1.889512
C  4.198075 0.86176 -0.472616
C  2.912504 0.816938 0.327933
C  -3.080922 -1.938416 -1.259803
C  -0.212076 0.983692 1.701379
C  4.009516 0.787864 -1.982467
C  -1.063671 -3.353412 2.462665
C  0.616742 -0.32978 -2.955543
C  -1.590396 1.623323 1.616765
C  5.320567 0.939073 -2.740257
H  -2.734956 -2.031694 2.719411
H  -1.186337 -1.239547 2.820704
H  0.382985 1.028451 -1.304238
H  -0.85611 1.180702 -2.519438
H  1.112134 -1.852495 0.825339
H  1.675689 -0.674235 2.03062
H  -3.585207 -2.90738 0.582593
H  -2.352964 -0.840529 -2.941109
H  4.860508 0.055795 -0.142023
H  4.705361 1.797545 -0.216183
H  3.135073 0.916323 1.396386
H  2.273441 1.66763 0.057636
H  -3.889888 -2.396597 -1.813478
H  3.544052 -0.162522 -2.24749
H  3.309587 1.568115 -2.29898
H  -1.007593 -3.609956 3.520595
H  -0.048254 -3.355442 2.067153
H  -1.612307 -4.146099 1.954108
H  0.013053 -0.887859 -3.672045
H  1.254542 -1.037541 -2.428808
H  1.26157 0.344247 -3.51963
H  -2.40539 0.909354 1.52816
H  -1.731363 2.234514 2.504169
H  6.030873 0.158655 -2.462077
H  5.793516 1.900336 -2.531962
H  5.16923 0.874254 -3.817909
totalener: -1328.97707852 hartree
nucrepener: 1982.17205952 hartree
electener: -3311.14913804 hartree
oneelecener: -5755.48886152 hartree
twoeener: 2444.33972348 hartree
kineticenergy: 1324.31018089 hartree
xcener: -107.425687325956 hartree
chargesum: -0.0000000
charge: -0.122995 -0.317577 -0.371257 0.023659 0.074504 -0.151353 -0.122641 -0.196811 -0.155888 0.067903 -0.029463 -0.053937 -0.100509 -0.014324 -0.168140 0.224567 -0.072904 -0.234584 -0.273884 -0.075601 -0.258864 0.090076 0.086615 0.056860 0.094900 0.103376 0.116439 0.115268 0.115137 0.058293 0.057278 0.099915 0.079132 0.125729 0.065144 0.045325 0.091391 0.078361 0.082485 0.087926 0.089650 0.085390 0.129564 0.144185 0.074110 0.073477 0.084076
qa: -0.1230 -0.3176 -0.3713 0.0237 0.0745 -0.1514 -0.1226 -0.1968 -0.1559 0.0679 -0.0295 -0.0539 -0.1005 -0.0143 -0.1681 0.2246 -0.0729 -0.2346 -0.2739 -0.0756 -0.2589 0.0901 0.0866 0.0569 0.0949 0.1034 0.1164 0.1153 0.1151 0.0583 0.0573 0.0999 0.0791 0.1257 0.0651 0.0453 0.0914 0.0784 0.0825 0.0879 0.0896 0.0854 0.1296 0.1442 0.0741 0.0735 0.0841
va: 1.1497 1.9795 2.1225 2.8515 3.7398 3.8053 3.8593 3.9023 3.8664 3.9766 3.8528 3.8632 3.9316 3.9157 4.0534 4.1718 3.8525 3.9202 3.9354 3.9567 3.9567 0.9989 1.0121 1.0377 1.0030 1.0015 1.0032 1.0037 1.0040 1.0188 1.0132 1.0104 0.9885 1.0019 1.0119 1.0080 1.0073 1.0090 1.0058 1.0136 1.0100 1.0036 1.0065 1.0077 1.0025 1.0028 1.0055
dispcorr: -0.027946201 hartree
energy: -1329.005024721975
dipole: 22.12433 -22.75998 -0.63566 -13.75225 12.78621 -0.96604 -9.64465 9.57200 -0.07265
magnitude: 1.15869 au
magnitude: 2.94516 debye
