program: Orca
programVersion: 5.0.2
elementType: Cl O O N C C C C C C C C C C C C C C C C C H H H H H H H H H H H H H H H H H H H H H H H H H H
charge: 0
multiplicity: 1
keywords: wb97x-d3
keywords: def2-TZVPP
keywords: def2/J RIJCOSX
keywords: DEFGRID2
keywords: scfconv7
keywords: smallprint printgap noloewdin
keywords: NOSOSCF
formula: C17H26ClNO2
InChI: InChI=1/C17H26ClNO2/c1-4-7-11-21-13-19(16(20)12-18)17-14(5-2)9-8-10-15(17)6-3/h8-10H,4-7,11-13H2,1-3H3
47 atoms
Cl -3.021004 0.779646 1.991156
O  2.092559 1.321607 -0.251348
O  -0.404002 3.03815 1.570124
N  0.007341 0.983824 0.693245
C  -0.436587 -0.144882 -0.058133
C  -0.649038 -1.35693 0.610697
C  -0.56748 -0.048237 -1.450881
C  -0.473266 -1.519137 2.098015
C  -0.343029 1.229128 -2.222917
C  1.423074 1.058773 0.947323
C  -1.005358 -2.472913 -0.138132
C  -0.914361 -1.194895 -2.158624
C  3.551597 -0.295981 -1.326127
C  3.423441 0.861502 -0.348752
C  -1.132145 -2.398049 -1.512664
C  -0.805497 2.028311 1.042276
C  2.887449 -1.589288 -0.86991
C  0.712702 -2.413151 2.458728
C  -1.56063 1.670933 -3.033135
C  -2.290264 1.851198 0.763826
C  3.013898 -2.70858 -1.892214
H  -1.387284 -1.954007 2.509259
H  -0.367278 -0.550757 2.584088
H  0.500377 1.074881 -2.900834
H  -0.030927 2.037044 -1.566044
H  1.749548 0.101534 1.370494
H  1.59737 1.841926 1.688599
H  -1.184871 -3.414318 0.367374
H  -1.006902 -1.144215 -3.236744
H  4.618812 -0.474708 -1.496117
H  3.138035 0.010656 -2.292094
H  3.81721 0.565559 0.633171
H  4.039109 1.699818 -0.687148
H  -1.401397 -3.278042 -2.08206
H  3.330431 -1.909218 0.079453
H  1.828292 -1.416219 -0.675182
H  0.596537 -3.419766 2.056632
H  0.814631 -2.499898 3.540548
H  1.650371 -2.017977 2.066387
H  -1.853244 0.929547 -3.776302
H  -1.348423 2.599049 -3.563683
H  -2.428703 1.849435 -2.397377
H  -2.767562 2.823793 0.846453
H  -2.50246 1.419288 -0.210563
H  4.057661 -2.944072 -2.107614
H  2.535918 -2.432626 -2.833459
H  2.532983 -3.620543 -1.538536
totalener: -1328.97144841 hartree
nucrepener: 2032.67156116 hartree
electener: -3361.64300956 hartree
oneelecener: -5856.32869741 hartree
twoeener: 2494.68568784 hartree
kineticenergy: 1324.31124353 hartree
xcener: -107.430566014524 hartree
chargesum: 0.0000000
charge: -0.128707 -0.315585 -0.365988 -0.018543 0.172375 -0.117748 -0.165611 -0.209525 -0.192719 0.047241 -0.035939 -0.047974 -0.109167 -0.000859 -0.178034 0.247134 -0.045223 -0.228633 -0.224517 -0.066152 -0.273151 0.094344 0.081176 0.086185 0.091355 0.093668 0.117973 0.111600 0.113286 0.066232 0.060583 0.067363 0.094419 0.123820 0.065452 0.009687 0.079169 0.095941 0.062515 0.074993 0.093478 0.070328 0.146522 0.114655 0.081740 0.074947 0.085892
qa: -0.1287 -0.3156 -0.3660 -0.0185 0.1724 -0.1177 -0.1656 -0.2095 -0.1927 0.0472 -0.0359 -0.0480 -0.1092 -0.0009 -0.1780 0.2471 -0.0452 -0.2286 -0.2245 -0.0662 -0.2732 0.0943 0.0812 0.0862 0.0914 0.0937 0.1180 0.1116 0.1133 0.0662 0.0606 0.0674 0.0944 0.1238 0.0655 0.0097 0.0792 0.0959 0.0625 0.0750 0.0935 0.0703 0.1465 0.1147 0.0817 0.0749 0.0859
va: 1.1490 1.9627 2.1426 2.9582 3.5335 3.7297 3.7685 3.8906 3.9147 3.9531 3.8422 3.8234 3.8436 3.9453 4.0439 4.1646 3.8425 3.9347 3.9171 3.9678 3.9663 1.0004 1.0224 1.0030 1.0257 0.9696 1.0292 1.0045 1.0040 1.0203 1.0111 0.9976 0.9999 1.0029 1.0114 1.0272 1.0072 1.0094 1.0060 1.0079 1.0065 1.0097 1.0061 1.0245 1.0053 1.0051 1.0067
dispcorr: -0.030274337 hartree
energy: -1329.001722742325
dipole: 23.42968 -22.93993 0.48976 -14.78595 13.61991 -1.16604 -15.61392 14.80548 -0.80844
magnitude: 1.50103 au
magnitude: 3.81531 debye
