program: Orca
programVersion: 5.0.2
elementType: Cl O O N C C C C C C C C C C C C C C C C C H H H H H H H H H H H H H H H H H H H H H H H H H H
charge: 0
multiplicity: 1
keywords: wb97x-d3
keywords: def2-TZVPP
keywords: def2/J RIJCOSX
keywords: DEFGRID2
keywords: scfconv7
keywords: smallprint printgap noloewdin
keywords: NOSOSCF
formula: C17H26ClNO2
InChI: InChI=1/C17H26ClNO2/c1-4-7-11-21-13-19(16(20)12-18)17-14(5-2)9-8-10-15(17)6-3/h8-10H,4-7,11-13H2,1-3H3
47 atoms
Cl -2.732306 1.672908 2.065946
O  2.351561 -0.420182 0.186032
O  0.519083 2.075688 1.696336
N  0.054832 0.133932 0.620686
C  -0.883848 -0.659146 -0.106112
C  -1.786451 -1.462136 0.600354
C  -0.879274 -0.627398 -1.507129
C  -1.752625 -1.621269 2.098058
C  0.120342 0.16925 -2.304657
C  1.288246 -0.497201 1.073521
C  -2.735983 -2.180658 -0.120661
C  -1.844086 -1.362892 -2.185044
C  4.310775 0.652087 -0.653066
C  3.03798 0.816505 0.151153
C  -2.775922 -2.124898 -1.500513
C  -0.245672 1.39889 1.048405
C  4.084866 0.30732 -2.120338
C  -1.241119 -2.998797 2.517569
C  -0.270342 1.627362 -2.533704
C  -1.623107 1.945475 0.693128
C  5.385442 0.242758 -2.908152
H  -2.760559 -1.475471 2.491771
H  -1.143076 -0.849441 2.565217
H  0.232521 -0.314784 -3.277348
H  1.099554 0.11846 -1.833738
H  1.077189 -1.558724 1.198663
H  1.547694 -0.069807 2.047259
H  -3.454333 -2.790225 0.414843
H  -1.857156 -1.34214 -3.268152
H  4.942356 -0.108908 -0.18465
H  4.864349 1.593812 -0.583707
H  3.272897 1.147853 1.169961
H  2.4157 1.600131 -0.30022
H  -3.524026 -2.685609 -2.045433
H  3.560601 -0.647514 -2.197464
H  3.42413 1.056748 -2.568966
H  -1.870384 -3.798215 2.126237
H  -1.226676 -3.090147 3.603754
H  -0.228501 -3.179417 2.15543
H  0.425383 2.102181 -3.226009
H  -0.245991 2.210888 -1.613857
H  -1.271073 1.712397 -2.958716
H  -1.535164 3.020385 0.553589
H  -2.077471 1.498338 -0.185776
H  6.056102 -0.516688 -2.502931
H  5.915604 1.196189 -2.878978
H  5.207726 -0.002763 -3.955252
totalener: -1328.97708211 hartree
nucrepener: 1975.66395661 hartree
electener: -3304.64103872 hartree
oneelecener: -5742.27063140 hartree
twoeener: 2437.62959268 hartree
kineticenergy: 1324.30417655 hartree
xcener: -107.425148914387 hartree
chargesum: -0.0000000
charge: -0.122996 -0.320302 -0.367356 0.026090 0.012251 -0.117725 -0.082379 -0.214174 -0.138902 0.093634 -0.050647 -0.028989 -0.106798 -0.013234 -0.159110 0.222892 -0.068120 -0.228703 -0.288795 -0.107453 -0.259216 0.094694 0.082903 0.081533 0.048111 0.097808 0.113108 0.114939 0.109813 0.061433 0.059310 0.101027 0.080478 0.125513 0.069731 0.040101 0.077440 0.090792 0.076418 0.097243 0.080611 0.097827 0.150353 0.137146 0.075970 0.072111 0.083619
qa: -0.1230 -0.3203 -0.3674 0.0261 0.0123 -0.1177 -0.0824 -0.2142 -0.1389 0.0936 -0.0506 -0.0290 -0.1068 -0.0132 -0.1591 0.2229 -0.0681 -0.2287 -0.2888 -0.1075 -0.2592 0.0947 0.0829 0.0815 0.0481 0.0978 0.1131 0.1149 0.1098 0.0614 0.0593 0.1010 0.0805 0.1255 0.0697 0.0401 0.0774 0.0908 0.0764 0.0972 0.0806 0.0978 0.1504 0.1371 0.0760 0.0721 0.0836
va: 1.1526 1.9850 2.1337 2.8737 3.8541 3.8093 3.8627 3.9197 3.9047 3.9713 3.8865 3.8390 3.9113 3.9066 4.0355 4.1598 3.8383 3.9300 3.9141 3.9876 3.9634 1.0038 1.0159 1.0124 1.0348 1.0066 1.0052 1.0048 1.0075 1.0201 1.0129 1.0094 0.9883 1.0019 1.0148 1.0090 1.0074 1.0072 1.0072 1.0094 1.0026 1.0022 1.0026 1.0046 1.0027 1.0022 1.0054
dispcorr: -0.027768558 hartree
energy: -1329.004850664171
dipole: 25.20774 -25.42220 -0.21446 -7.50896 6.83358 -0.67538 -17.31258 16.42405 -0.88853
magnitude: 1.13650 au
magnitude: 2.88875 debye
