program: Orca
programVersion: 5.0.2
elementType: Cl O O N C C C C C C C C C C C C C C C C C H H H H H H H H H H H H H H H H H H H H H H H H H H
charge: 0
multiplicity: 1
keywords: wb97x-d3
keywords: def2-TZVPP
keywords: def2/J RIJCOSX
keywords: DEFGRID2
keywords: scfconv7
keywords: smallprint printgap noloewdin
keywords: NOSOSCF
formula: C17H26ClNO2
InChI: InChI=1/C17H26ClNO2/c1-4-7-11-21-13-19(16(20)12-18)17-14(5-2)9-8-10-15(17)6-3/h8-10H,4-7,11-13H2,1-3H3
47 atoms
Cl -2.44358 1.371738 2.432812
O  2.161389 -0.670736 -0.255975
O  0.895438 1.814806 1.771976
N  0.062694 0.016174 0.670384
C  -1.00871 -0.596485 -0.045706
C  -1.790797 -1.561989 0.606809
C  -1.24561 -0.248371 -1.379679
C  -1.513694 -1.970758 2.032738
C  -0.406344 0.743526 -2.141059
C  1.29477 -0.742933 0.824813
C  -2.822516 -2.161731 -0.10506
C  -2.300567 -0.863059 -2.047119
C  4.034587 0.272169 -1.38551
C  2.96071 0.491779 -0.338978
C  -3.081869 -1.813039 -1.419353
C  -0.029223 1.265772 1.217083
C  4.94255 1.487188 -1.535796
C  -2.7494 -2.341238 2.843776
C  0.48951 0.061044 -3.173198
C  -1.378696 1.962386 1.125486
C  6.01459 1.28776 -2.597243
H  -0.989372 -1.167589 2.549235
H  -0.823157 -2.821575 2.027344
H  0.214484 1.335726 -1.469951
H  -1.067637 1.452096 -2.647644
H  1.019734 -1.793167 0.918881
H  1.775927 -0.419699 1.752566
H  -3.442746 -2.906921 0.374254
H  -2.504172 -0.59097 -3.076122
H  3.565065 0.044837 -2.347377
H  4.631432 -0.604185 -1.11651
H  3.418151 0.712541 0.634442
H  2.358765 1.369614 -0.605981
H  -3.897547 -2.283705 -1.952422
H  4.340933 2.3663 -1.78584
H  5.416748 1.711775 -0.575761
H  -3.489334 -1.54208 2.813725
H  -2.477103 -2.506865 3.885627
H  -3.22523 -3.255618 2.490142
H  -0.098488 -0.481759 -3.913842
H  1.156206 -0.649513 -2.68884
H  1.096977 0.794803 -3.704253
H  -1.222157 3.025699 1.285543
H  -1.898537 1.804374 0.184133
H  6.653911 0.436457 -2.358714
H  6.655229 2.165003 -2.688455
H  5.571586 1.099782 -3.57653
totalener: -1328.97809247 hartree
nucrepener: 1959.22284835 hartree
electener: -3288.20094082 hartree
oneelecener: -5709.45230200 hartree
twoeener: 2421.25136117 hartree
kineticenergy: 1324.29978623 hartree
xcener: -107.426180724107 hartree
chargesum: -0.0000000
charge: -0.125180 -0.317803 -0.369059 0.007185 0.105777 -0.076047 -0.189825 -0.219581 -0.173760 0.092430 -0.052550 -0.054937 -0.079515 -0.014960 -0.163445 0.212922 -0.088502 -0.250653 -0.271421 -0.067734 -0.260526 0.099725 0.088558 0.071344 0.097731 0.099794 0.112789 0.116105 0.114342 0.053678 0.065643 0.093958 0.072223 0.124965 0.055616 0.058527 0.089842 0.089849 0.077615 0.086866 0.094293 0.089063 0.143617 0.127838 0.074292 0.085608 0.073304
qa: -0.1252 -0.3178 -0.3691 0.0072 0.1058 -0.0760 -0.1898 -0.2196 -0.1738 0.0924 -0.0526 -0.0549 -0.0795 -0.0150 -0.1634 0.2129 -0.0885 -0.2507 -0.2714 -0.0677 -0.2605 0.0997 0.0886 0.0713 0.0977 0.0998 0.1128 0.1161 0.1143 0.0537 0.0656 0.0940 0.0722 0.1250 0.0556 0.0585 0.0898 0.0898 0.0776 0.0869 0.0943 0.0891 0.1436 0.1278 0.0743 0.0856 0.0733
va: 1.1531 1.9881 2.1271 2.8901 3.7522 3.7723 3.8206 3.8970 3.8651 3.9780 3.8645 3.8743 3.8649 3.9121 4.0628 4.1948 3.8893 3.9369 3.9039 3.9643 3.9544 1.0081 0.9970 1.0244 0.9992 0.9986 1.0064 1.0055 1.0037 1.0149 1.0198 1.0089 0.9859 1.0026 1.0068 1.0090 1.0135 1.0072 1.0014 1.0111 1.0216 1.0039 1.0089 1.0090 1.0030 1.0052 1.0030
dispcorr: -0.026871246 hartree
energy: -1329.004963720419
dipole: 24.43703 -24.72737 -0.29034 -4.92778 4.52309 -0.40469 -18.89504 18.07237 -0.82267
magnitude: 0.96170 au
magnitude: 2.44445 debye
