program: Orca
programVersion: 5.0.2
elementType: Cl O O N C C C C C C C C C C C C C C C C C H H H H H H H H H H H H H H H H H H H H H H H H H H
charge: 0
multiplicity: 1
keywords: wb97x-d3
keywords: def2-TZVPP
keywords: def2/J RIJCOSX
keywords: DEFGRID2
keywords: scfconv7
keywords: smallprint printgap noloewdin
keywords: NOSOSCF
formula: C17H26ClNO2
InChI: InChI=1/C17H26ClNO2/c1-4-7-11-21-13-19(16(20)12-18)17-14(5-2)9-8-10-15(17)6-3/h8-10H,4-7,11-13H2,1-3H3
47 atoms
Cl -2.741798 2.288766 1.179023
O  1.95544 -0.113583 -1.02275
O  0.692753 2.456015 0.893663
N  -0.153119 0.642983 -0.173727
C  -1.133689 -0.391557 -0.241405
C  -0.980938 -1.551118 0.528531
C  -2.234648 -0.227353 -1.091547
C  0.202642 -1.799502 1.425421
C  -2.42327 0.978815 -1.973454
C  0.850736 0.70142 -1.225127
C  -1.966465 -2.529762 0.455458
C  -3.192143 -1.234174 -1.137512
C  4.171676 -0.489698 -0.234246
C  2.930938 0.372845 -0.123539
C  -3.066811 -2.375563 -0.367464
C  -0.147049 1.588279 0.813929
C  5.275651 -0.021763 0.706045
C  1.147978 -2.85284 0.851072
C  -2.259549 0.649368 -3.456547
C  -1.269463 1.523532 1.838956
C  6.524869 -0.886291 0.6162
H  -0.158879 -2.131733 2.402459
H  0.760771 -0.881555 1.605503
H  -1.738247 1.778458 -1.695321
H  -3.424872 1.38017 -1.804573
H  1.140414 1.74796 -1.358825
H  0.380872 0.345786 -2.141386
H  -1.866485 -3.424315 1.058931
H  -4.057057 -1.110187 -1.778377
H  4.533809 -0.475655 -1.266338
H  3.914163 -1.5291 -0.009322
H  2.562099 0.357099 0.909728
H  3.173292 1.419014 -0.35175
H  -3.828494 -3.143305 -0.405794
H  5.53417 1.017052 0.480337
H  4.906028 -0.021441 1.735886
H  0.643428 -3.810001 0.718006
H  1.996156 -3.015033 1.517166
H  1.530039 -2.536207 -0.117092
H  -2.982753 -0.097617 -3.784069
H  -1.267438 0.253389 -3.67583
H  -2.404238 1.540123 -4.068024
H  -1.531827 0.512472 2.140105
H  -0.962854 2.098028 2.708845
H  6.938653 -0.880698 -0.393262
H  6.307441 -1.923895 0.874285
H  7.30373 -0.535127 1.2930
totalener: -1328.97817936 hartree
nucrepener: 1961.49737840 hartree
electener: -3290.47555776 hartree
oneelecener: -5714.00412203 hartree
twoeener: 2423.52856427 hartree
kineticenergy: 1324.31058702 hartree
xcener: -107.426586681754 hartree
chargesum: -0.0000000
charge: -0.123827 -0.320295 -0.369888 0.004274 0.112735 -0.169164 -0.118838 -0.171030 -0.212715 0.089467 -0.045493 -0.040390 -0.075465 -0.015236 -0.172855 0.219208 -0.087492 -0.271302 -0.227896 -0.063753 -0.260348 0.096254 0.069692 0.083485 0.092624 0.114374 0.102726 0.114904 0.113566 0.064418 0.052670 0.071616 0.093497 0.124578 0.057904 0.055224 0.086472 0.087767 0.093836 0.076563 0.077904 0.089632 0.124515 0.143544 0.074150 0.072857 0.085532
qa: -0.1238 -0.3203 -0.3699 0.0043 0.1127 -0.1692 -0.1188 -0.1710 -0.2127 0.0895 -0.0455 -0.0404 -0.0755 -0.0152 -0.1729 0.2192 -0.0875 -0.2713 -0.2279 -0.0638 -0.2603 0.0963 0.0697 0.0835 0.0926 0.1144 0.1027 0.1149 0.1136 0.0644 0.0527 0.0716 0.0935 0.1246 0.0579 0.0552 0.0865 0.0878 0.0938 0.0766 0.0779 0.0896 0.1245 0.1435 0.0742 0.0729 0.0855
va: 1.1510 1.9887 2.1265 2.8912 3.7082 3.8271 3.7776 3.8626 3.9170 3.9684 3.8610 3.8677 3.8641 3.9143 4.0597 4.1952 3.8901 3.9052 3.9308 3.9648 3.9548 0.9992 1.0262 1.0169 1.0013 1.0062 1.0053 1.0036 1.0049 1.0198 1.0148 0.9860 1.0088 1.0023 1.0092 1.0069 1.0116 1.0034 1.0221 1.0072 1.0074 1.0073 1.0087 1.0087 1.0030 1.0029 1.0053
dispcorr: -0.026980880 hartree
energy: -1329.005160243853
dipole: 29.43864 -29.61183 -0.17318 -16.16712 15.20846 -0.95866 -6.68950 6.63751 -0.05199
magnitude: 0.97557 au
magnitude: 2.47969 debye
