program: Orca
programVersion: 5.0.2
elementType: Cl O O N C C C C C C C C C C C C C C C C C H H H H H H H H H H H H H H H H H H H H H H H H H H
charge: 0
multiplicity: 1
keywords: wb97x-d3
keywords: def2-TZVPP
keywords: def2/J RIJCOSX
keywords: DEFGRID2
keywords: scfconv7
keywords: smallprint printgap noloewdin
keywords: NOSOSCF
formula: C17H26ClNO2
InChI: InChI=1/C17H26ClNO2/c1-4-7-11-21-13-19(16(20)12-18)17-14(5-2)9-8-10-15(17)6-3/h8-10H,4-7,11-13H2,1-3H3
47 atoms
Cl -1.571838 1.407446 2.657116
O  1.970818 -0.902924 -0.263092
O  0.930494 2.371285 0.562149
N  -0.003099 0.452956 -0.215303
C  -1.164344 -0.36151 -0.376597
C  -1.440466 -1.380983 0.539842
C  -2.00322 -0.125943 -1.47646
C  -0.550823 -1.722103 1.70439
C  -1.726638 0.938184 -2.508069
C  1.208699 0.049456 -0.918023
C  -2.592684 -2.139859 0.349737
C  -3.13942 -0.91032 -1.627645
C  4.295969 -0.577958 0.336708
C  2.842679 -0.450224 0.76253
C  -3.438045 -1.909881 -0.71843
C  -0.036617 1.651969 0.439173
C  4.710142 0.311988 -0.83221
C  0.171459 -3.053019 1.50652
C  -1.25904 0.355059 -3.841149
C  -1.374245 2.08748 1.018842
C  4.655084 1.80426 -0.528875
H  -1.165744 -1.771667 2.606205
H  0.176891 -0.933879 1.884342
H  -0.98477 1.653276 -2.15207
H  -2.641456 1.512867 -2.67518
H  1.7767 0.954147 -1.14717
H  0.895555 -0.411587 -1.855288
H  -2.828782 -2.921388 1.062072
H  -3.802868 -0.726267 -2.464559
H  4.496565 -1.623605 0.087773
H  4.918893 -0.3467 1.207377
H  2.667496 -1.078959 1.640816
H  2.611554 0.576227 1.057988
H  -4.332589 -2.5061 -0.841823
H  5.72991 0.045956 -1.122238
H  4.092509 0.082107 -1.705061
H  0.814278 -3.018988 0.629118
H  -0.530643 -3.877818 1.377965
H  0.792871 -3.283445 2.372878
H  -1.074711 1.146152 -4.568087
H  -2.004463 -0.318794 -4.263305
H  -0.336379 -0.213858 -3.727105
H  -1.360447 3.170157 1.112968
H  -2.234224 1.779865 0.429492
H  5.29657 2.056009 0.317735
H  3.649529 2.148877 -0.285003
H  4.998791 2.389472 -1.382297
totalener: -1328.97497298 hartree
nucrepener: 1992.40447437 hartree
electener: -3321.37944735 hartree
oneelecener: -5775.95493493 hartree
twoeener: 2454.57548758 hartree
kineticenergy: 1324.30466916 hartree
xcener: -107.427418462155 hartree
chargesum: 0.0000000
charge: -0.121733 -0.339507 -0.390636 0.022932 0.040315 -0.103286 -0.140992 -0.197011 -0.217977 0.093361 -0.048347 -0.028101 -0.115617 -0.008714 -0.170733 0.260504 -0.127208 -0.264975 -0.227513 -0.077919 -0.247468 0.094312 0.070670 0.087023 0.093625 0.123795 0.111218 0.114846 0.114633 0.070659 0.060791 0.081412 0.110395 0.125409 0.071744 0.059106 0.097729 0.078090 0.085191 0.090528 0.080080 0.078899 0.144910 0.128087 0.073718 0.081427 0.082329
qa: -0.1217 -0.3395 -0.3906 0.0229 0.0403 -0.1033 -0.1410 -0.1970 -0.2180 0.0934 -0.0483 -0.0281 -0.1156 -0.0087 -0.1707 0.2605 -0.1272 -0.2650 -0.2275 -0.0779 -0.2475 0.0943 0.0707 0.0870 0.0936 0.1238 0.1112 0.1148 0.1146 0.0707 0.0608 0.0814 0.1104 0.1254 0.0717 0.0591 0.0977 0.0781 0.0852 0.0905 0.0801 0.0789 0.1449 0.1281 0.0737 0.0814 0.0823
va: 1.1507 1.9502 2.1029 2.8800 3.8082 3.8021 3.7737 3.8977 3.9150 3.9182 3.8638 3.8516 3.9434 3.8475 4.0558 4.1219 3.8788 3.9101 3.9205 3.9768 3.9238 1.0028 1.0190 1.0130 0.9984 0.9854 1.0080 1.0039 1.0036 1.0168 1.0150 0.9954 1.0016 1.0020 1.0098 1.0135 1.0192 1.0115 1.0049 1.0072 1.0069 1.0088 1.0059 1.0077 1.0047 1.0151 1.0058
dispcorr: -0.028166897 hartree
energy: -1329.003139876137
dipole: 20.53700 -21.18836 -0.65136 -7.70143 7.31274 -0.38869 -15.89215 15.06164 -0.83051
magnitude: 1.12477 au
magnitude: 2.85893 debye
