program: Orca
programVersion: 5.0.2
elementType: Cl O O N C C C C C C C C C C C C C C C C C H H H H H H H H H H H H H H H H H H H H H H H H H H
charge: 0
multiplicity: 1
keywords: wb97x-d3
keywords: def2-TZVPP
keywords: def2/J RIJCOSX
keywords: DEFGRID2
keywords: scfconv7
keywords: smallprint printgap noloewdin
keywords: NOSOSCF
formula: C17H26ClNO2
InChI: InChI=1/C17H26ClNO2/c1-4-7-11-21-13-19(16(20)12-18)17-14(5-2)9-8-10-15(17)6-3/h8-10H,4-7,11-13H2,1-3H3
47 atoms
Cl -2.836646 2.296719 0.786369
O  2.176216 -0.119163 -0.451826
O  0.584629 2.461684 1.165443
N  -0.052569 0.637702 -0.022711
C  -0.988156 -0.41631 -0.246868
C  -0.988575 -1.540085 0.585784
C  -1.878586 -0.307475 -1.327108
C  -0.021813 -1.731937 1.724841
C  -1.854556 0.884722 -2.251464
C  1.128281 0.687204 -0.870852
C  -1.91846 -2.546149 0.339757
C  -2.774762 -1.346152 -1.546455
C  4.246165 -0.425474 0.687061
C  2.962853 0.376787 0.613583
C  -2.802287 -2.454467 -0.717226
C  -0.227325 1.593012 0.939819
C  5.136914 -0.279005 -0.54051
C  1.036356 -2.787137 1.407625
C  -3.211306 1.29015 -2.813155
C  -1.52383 1.543499 1.734202
C  6.430436 -1.071525 -0.421393
H  -0.579979 -2.037243 2.614197
H  0.475498 -0.798662 1.986059
H  -1.174973 0.672455 -3.084355
H  -1.427153 1.742138 -1.732858
H  1.434583 1.733278 -0.964496
H  0.839228 0.315888 -1.853669
H  -1.941677 -3.414652 0.987477
H  -3.473201 -1.288438 -2.370349
H  4.006891 -1.48074 0.852854
H  4.791328 -0.095886 1.577282
H  2.424585 0.30363 1.566231
H  3.188904 1.43996 0.460369
H  -3.516934 -3.246653 -0.898047
H  4.590414 -0.599678 -1.429334
H  5.369539 0.779975 -0.690491
H  1.723976 -2.908656 2.245295
H  1.613638 -2.49975 0.530911
H  0.582228 -3.757941 1.20791
H  -3.933674 1.450594 -2.013483
H  -3.623531 0.547344 -3.495739
H  -3.120055 2.220203 -3.373534
H  -1.844251 0.538736 1.997438
H  -1.388888 2.134327 2.636118
H  7.014616 -0.755511 0.444809
H  7.05782 -0.945322 -1.303896
H  6.231993 -2.138799 -0.30998
totalener: -1328.97832512 hartree
nucrepener: 1965.13061476 hartree
electener: -3294.10893988 hartree
oneelecener: -5721.30465837 hartree
twoeener: 2427.19571849 hartree
kineticenergy: 1324.30207853 hartree
xcener: -107.426687468440 hartree
chargesum: 0.0000000
charge: -0.125055 -0.324297 -0.369422 0.007307 0.113129 -0.193584 -0.081527 -0.185995 -0.215866 0.103043 -0.052126 -0.048298 -0.110871 -0.031463 -0.164806 0.213733 -0.065429 -0.262496 -0.250050 -0.065786 -0.260082 0.097565 0.071150 0.087367 0.099619 0.110958 0.097671 0.114319 0.115255 0.058559 0.065789 0.090639 0.100051 0.124882 0.065143 0.047571 0.089929 0.090905 0.085954 0.090110 0.077122 0.089823 0.126905 0.143816 0.070812 0.084192 0.073836
qa: -0.1251 -0.3243 -0.3694 0.0073 0.1131 -0.1936 -0.0815 -0.1860 -0.2159 0.1030 -0.0521 -0.0483 -0.1109 -0.0315 -0.1648 0.2137 -0.0654 -0.2625 -0.2501 -0.0658 -0.2601 0.0976 0.0711 0.0874 0.0996 0.1110 0.0977 0.1143 0.1153 0.0586 0.0658 0.0906 0.1001 0.1249 0.0651 0.0476 0.0899 0.0909 0.0860 0.0901 0.0771 0.0898 0.1269 0.1438 0.0708 0.0842 0.0738
va: 1.1530 1.9674 2.1271 2.8924 3.7345 3.8236 3.7748 3.8748 3.8983 3.9704 3.8719 3.8615 3.9017 3.9064 4.0645 4.1952 3.8527 3.9042 3.9389 3.9645 3.9536 0.9993 1.0256 0.9973 1.0075 1.0063 1.0002 1.0037 1.0055 1.0130 1.0148 0.9921 1.0074 1.0025 1.0223 1.0111 1.0043 1.0221 1.0105 1.0126 1.0016 1.0070 1.0092 1.0093 1.0024 1.0060 1.0029
dispcorr: -0.027057663 hartree
energy: -1329.005382780305
dipole: 27.49704 -27.68659 -0.18954 -15.36306 14.41552 -0.94754 -5.33883 5.24805 -0.09077
magnitude: 0.97056 au
magnitude: 2.46698 debye
