program: Orca
programVersion: 5.0.2
elementType: Cl O O N C C C C C C C C C C C C C C C C C H H H H H H H H H H H H H H H H H H H H H H H H H H
charge: 0
multiplicity: 1
keywords: wb97x-d3
keywords: def2-TZVPP
keywords: def2/J RIJCOSX
keywords: DEFGRID2
keywords: scfconv7
keywords: smallprint printgap noloewdin
keywords: NOSOSCF
formula: C17H26ClNO2
InChI: InChI=1/C17H26ClNO2/c1-4-7-11-21-13-19(16(20)12-18)17-14(5-2)9-8-10-15(17)6-3/h8-10H,4-7,11-13H2,1-3H3
47 atoms
Cl -1.362232 1.250783 2.772093
O  2.155182 -0.02927 -0.588994
O  0.241853 2.744937 0.38578
N  -0.123331 0.678499 -0.477268
C  -0.996713 -0.431551 -0.687729
C  -0.927208 -1.559312 0.140457
C  -1.877808 -0.376688 -1.775897
C  0.059449 -1.66741 1.27522
C  -1.975035 0.819203 -2.688232
C  1.135495 0.675732 -1.210405
C  -1.786874 -2.619966 -0.13323
C  -2.714013 -1.460932 -2.011856
C  3.97754 -0.159594 0.970907
C  2.781753 0.637613 0.488675
C  -2.673505 -2.574901 -1.193578
C  -0.453269 1.759744 0.292603
C  5.193193 -0.182863 0.045393
C  -0.478476 -2.359294 2.522104
C  -3.119462 1.760181 -2.316188
C  -1.753161 1.676626 1.080789
C  5.053171 -1.034738 -1.20961
H  0.407068 -0.676969 1.557495
H  0.945071 -2.195547 0.910936
H  -2.131957 0.462188 -3.708677
H  -1.041489 1.382162 -2.70872
H  1.418819 1.715236 -1.400364
H  0.956875 0.175023 -2.162223
H  -1.758844 -3.5033 0.490515
H  -3.398915 -1.430059 -2.851197
H  3.66052 -1.181338 1.203933
H  4.278637 0.284582 1.923985
H  2.081713 0.769232 1.321976
H  3.096893 1.64455 0.182361
H  -3.327451 -3.414998 -1.387547
H  5.449383 0.844594 -0.232253
H  6.046066 -0.552117 0.621568
H  0.261314 -2.312359 3.320829
H  -0.702257 -3.413558 2.359446
H  -1.384744 -1.873026 2.88162
H  -2.974183 2.208209 -1.333128
H  -4.074566 1.234427 -2.29851
H  -3.199223 2.576061 -3.034495
H  -2.212344 2.662711 1.091759
H  -2.465383 0.942593 0.715177
H  4.293202 -0.650969 -1.886221
H  4.778085 -2.060491 -0.95841
H  5.997249 -1.073236 -1.754692
totalener: -1328.97434623 hartree
nucrepener: 1980.42602707 hartree
electener: -3309.40037330 hartree
oneelecener: -5751.88045736 hartree
twoeener: 2442.48008406 hartree
kineticenergy: 1324.30138823 hartree
xcener: -107.425290491219 hartree
chargesum: -0.0000000
charge: -0.120626 -0.322859 -0.365961 0.005909 -0.009582 -0.073612 -0.089158 -0.167342 -0.192351 0.087178 -0.059847 -0.048745 -0.122096 -0.010248 -0.151805 0.240558 -0.094933 -0.239246 -0.245062 -0.116887 -0.235483 0.053492 0.090010 0.088799 0.084443 0.114101 0.098780 0.116929 0.114072 0.060601 0.076859 0.094422 0.091046 0.126162 0.044845 0.066118 0.088992 0.078151 0.081818 0.075602 0.086039 0.094546 0.147773 0.134718 0.075536 0.067688 0.080656
qa: -0.1206 -0.3229 -0.3660 0.0059 -0.0096 -0.0736 -0.0892 -0.1673 -0.1924 0.0872 -0.0598 -0.0487 -0.1221 -0.0102 -0.1518 0.2406 -0.0949 -0.2392 -0.2451 -0.1169 -0.2355 0.0535 0.0900 0.0888 0.0844 0.1141 0.0988 0.1169 0.1141 0.0606 0.0769 0.0944 0.0910 0.1262 0.0448 0.0661 0.0890 0.0782 0.0818 0.0756 0.0860 0.0945 0.1478 0.1347 0.0755 0.0677 0.0807
va: 1.1554 1.9781 2.1372 2.8630 3.8479 3.8769 3.8760 3.9118 3.9291 3.9648 3.8649 3.8718 3.9177 3.8914 4.0385 4.1293 3.8994 3.9166 3.9150 3.9823 3.9334 1.0293 1.0096 1.0005 1.0048 1.0073 0.9940 1.0076 1.0058 1.0152 1.0110 0.9907 1.0050 1.0021 1.0116 1.0051 1.0064 1.0063 1.0180 1.0095 1.0034 1.0089 1.0012 1.0031 1.0186 1.0058 1.0040
dispcorr: -0.027625455 hartree
energy: -1329.001971682261
dipole: 16.17361 -16.83659 -0.66298 -8.94794 8.26087 -0.68707 -10.72755 9.96181 -0.76574
magnitude: 1.22392 au
magnitude: 3.11095 debye
