program: Orca
programVersion: 5.0.2
elementType: Cl O O N C C C C C C C C C C C C C C C C C H H H H H H H H H H H H H H H H H H H H H H H H H H
charge: 0
multiplicity: 1
keywords: wb97x-d3
keywords: def2-TZVPP
keywords: def2/J RIJCOSX
keywords: DEFGRID2
keywords: scfconv7
keywords: smallprint printgap noloewdin
keywords: NOSOSCF
formula: C17H26ClNO2
InChI: InChI=1/C17H26ClNO2/c1-4-7-11-21-13-19(16(20)12-18)17-14(5-2)9-8-10-15(17)6-3/h8-10H,4-7,11-13H2,1-3H3
47 atoms
Cl -1.960983 3.082872 2.094775
O  2.033386 -0.289091 -0.624771
O  0.581852 1.753932 1.769147
N  -0.046183 -0.040197 0.533082
C  -1.0999 -0.782851 -0.077816
C  -1.733404 -1.79158 0.662718
C  -1.490355 -0.499952 -1.392143
C  -1.346974 -2.132067 2.078902
C  -0.841842 0.564141 -2.236797
C  1.296666 -0.597198 0.509279
C  -2.763075 -2.509395 0.065594
C  -2.529616 -1.239701 -1.947903
C  3.549849 1.095652 -1.834794
C  2.587096 1.011128 -0.667083
C  -3.162099 -2.238188 -1.230927
C  -0.284486 1.127146 1.214085
C  4.705973 0.100132 -1.790368
C  -0.605664 -3.463769 2.186841
C  0.026032 -0.024334 -3.347566
C  -1.746992 1.564715 1.218976
C  5.610821 0.25739 -0.576349
H  -2.255098 -2.186065 2.684959
H  -0.73818 -1.34301 2.520507
H  -0.237726 1.232861 -1.625439
H  -1.626196 1.182764 -2.681723
H  1.198207 -1.682411 0.519492
H  1.810767 -0.279138 1.421387
H  -3.266714 -3.283491 0.632648
H  -2.849463 -1.020811 -2.95985
H  3.944343 2.116334 -1.85775
H  2.992551 0.964842 -2.766644
H  3.094835 1.239084 0.278404
H  1.805204 1.770633 -0.786827
H  -3.972908 -2.798224 -1.678176
H  4.313873 -0.917814 -1.828112
H  5.300902 0.227445 -2.698052
H  0.325966 -3.452951 1.621369
H  -1.208241 -4.286923 1.802871
H  -0.361271 -3.686675 3.225289
H  0.834083 -0.620629 -2.928856
H  0.466852 0.769761 -3.951185
H  -0.556137 -0.661747 -4.013849
H  -2.114408 1.699611 0.201858
H  -2.374124 0.803744 1.684556
H  5.087833 0.038682 0.355023
H  6.004948 1.272377 -0.501758
H  6.462478 -0.42062 -0.632387
totalener: -1328.97728868 hartree
nucrepener: 1950.70257545 hartree
electener: -3279.67986413 hartree
oneelecener: -5692.28424208 hartree
twoeener: 2412.60437795 hartree
kineticenergy: 1324.30794095 hartree
xcener: -107.427652563570 hartree
chargesum: 0.0000000
charge: -0.104272 -0.325580 -0.350787 -0.008003 0.115212 -0.142082 -0.172359 -0.217322 -0.183478 0.110264 -0.029084 -0.047847 -0.134438 -0.041078 -0.169370 0.216598 -0.083867 -0.227515 -0.271193 -0.076778 -0.265924 0.094981 0.090707 0.074249 0.099567 0.099621 0.110980 0.115774 0.116231 0.072456 0.072267 0.105823 0.096498 0.127203 0.064568 0.064365 0.077924 0.079538 0.091850 0.094173 0.088976 0.084658 0.122862 0.124894 0.077357 0.075965 0.085416
qa: -0.1043 -0.3256 -0.3508 -0.0080 0.1152 -0.1421 -0.1724 -0.2173 -0.1835 0.1103 -0.0291 -0.0478 -0.1344 -0.0411 -0.1694 0.2166 -0.0839 -0.2275 -0.2712 -0.0768 -0.2659 0.0950 0.0907 0.0742 0.0996 0.0996 0.1110 0.1158 0.1162 0.0725 0.0723 0.1058 0.0965 0.1272 0.0646 0.0644 0.0779 0.0795 0.0919 0.0942 0.0890 0.0847 0.1229 0.1249 0.0774 0.0760 0.0854
va: 1.1709 1.9617 2.1463 2.8729 3.6995 3.8103 3.8645 3.9085 3.8661 3.9481 3.8516 3.8637 3.9143 3.8831 4.0552 4.1554 3.8609 3.9232 3.9098 4.0377 3.9449 0.9977 1.0133 1.0302 0.9976 1.0059 1.0079 1.0040 1.0038 1.0134 1.0139 0.9999 0.9964 1.0018 1.0206 1.0087 1.0081 1.0067 1.0072 1.0203 1.0034 1.0121 1.0089 1.0059 1.0015 1.0025 1.0063
dispcorr: -0.026739358 hartree
energy: -1329.004028038428
dipole: 23.68397 -24.18612 -0.50214 -16.90615 15.57966 -1.32649 -15.88377 15.11165 -0.77212
magnitude: 1.61490 au
magnitude: 4.10474 debye
