program: Orca
programVersion: 5.0.2
elementType: Cl O O N C C C C C C C C C C C C C C C C C H H H H H H H H H H H H H H H H H H H H H H H H H H
charge: 0
multiplicity: 1
keywords: wb97x-d3
keywords: def2-TZVPP
keywords: def2/J RIJCOSX
keywords: DEFGRID2
keywords: scfconv7
keywords: smallprint printgap noloewdin
keywords: NOSOSCF
formula: C17H26ClNO2
InChI: InChI=1/C17H26ClNO2/c1-4-7-11-21-13-19(16(20)12-18)17-14(5-2)9-8-10-15(17)6-3/h8-10H,4-7,11-13H2,1-3H3
47 atoms
Cl -2.335227 1.645893 2.356641
O  2.278771 -0.821586 -0.144094
O  0.81953 1.820583 1.535651
N  0.099273 -0.0741 0.52005
C  -0.941928 -0.784662 -0.150763
C  -1.810328 -1.588604 0.602289
C  -1.056594 -0.689529 -1.542777
C  -1.625501 -1.783175 2.087539
C  -0.105138 0.109499 -2.395192
C  1.316383 -0.80337 0.854001
C  -2.835777 -2.250192 -0.065628
C  -2.101923 -1.363344 -2.165478
C  4.123394 0.118715 -1.315392
C  3.04974 0.355941 -0.273968
C  -2.990183 -2.130863 -1.435022
C  -0.062306 1.202949 0.984664
C  4.998063 1.349429 -1.520564
C  -2.915539 -1.935001 2.883726
C  -0.499141 1.573771 -2.571867
C  -1.439342 1.833708 0.822161
C  6.069818 1.136282 -2.579069
H  -1.060747 -0.951999 2.506776
H  -1.003158 -2.671281 2.243872
H  -0.067906 -0.359471 -3.380945
H  0.904274 0.040405 -1.995809
H  1.033529 -1.843011 1.019651
H  1.710707 -0.390609 1.787756
H  -3.526373 -2.86969 0.490549
H  -2.207292 -1.293654 -3.241536
H  3.652616 -0.160191 -2.263557
H  4.74305 -0.731484 -1.015982
H  3.501352 0.625848 0.690067
H  2.427275 1.20793 -0.575302
H  -3.795803 -2.652111 -1.935369
H  4.371404 2.201176 -1.801875
H  5.470355 1.625065 -0.57306
H  -2.693916 -1.957066 3.950281
H  -3.448169 -2.85685 2.650852
H  -3.58849 -1.098557 2.700286
H  0.156247 2.061746 -3.29352
H  -0.419808 2.135968 -1.641761
H  -1.523204 1.671018 -2.934029
H  -1.311723 2.899817 0.649549
H  -2.049139 1.403772 0.033436
H  6.684723 2.026608 -2.710185
H  5.627438 0.895368 -3.5469
H  6.734024 0.31389 -2.309223
totalener: -1328.97679789 hartree
nucrepener: 1955.39052857 hartree
electener: -3284.36732646 hartree
oneelecener: -5701.69906887 hartree
twoeener: 2417.33174242 hartree
kineticenergy: 1324.30138703 hartree
xcener: -107.425859933105 hartree
chargesum: 0.0000000
charge: -0.121803 -0.317908 -0.366791 0.016637 -0.010615 -0.073305 -0.094478 -0.217700 -0.181907 0.097081 -0.055128 -0.036159 -0.082504 -0.011240 -0.156149 0.226629 -0.089968 -0.247835 -0.272285 -0.111935 -0.259943 0.097984 0.090721 0.080819 0.087206 0.096949 0.110584 0.116550 0.110774 0.056076 0.064809 0.094937 0.074926 0.125309 0.056349 0.057355 0.091539 0.078218 0.087236 0.096080 0.078407 0.094593 0.149289 0.138085 0.085365 0.072815 0.074332
qa: -0.1218 -0.3179 -0.3668 0.0166 -0.0106 -0.0733 -0.0945 -0.2177 -0.1819 0.0971 -0.0551 -0.0362 -0.0825 -0.0112 -0.1561 0.2266 -0.0900 -0.2478 -0.2723 -0.1119 -0.2599 0.0980 0.0907 0.0808 0.0872 0.0969 0.1106 0.1165 0.1108 0.0561 0.0648 0.0949 0.0749 0.1253 0.0563 0.0574 0.0915 0.0782 0.0872 0.0961 0.0784 0.0946 0.1493 0.1381 0.0854 0.0728 0.0743
va: 1.1569 1.9936 2.1345 2.8764 3.9032 3.7955 3.8645 3.8985 3.9128 3.9809 3.8816 3.8512 3.8568 3.9081 4.0456 4.1457 3.8856 3.9323 3.9086 3.9862 3.9534 1.0080 0.9972 1.0109 1.0175 0.9973 1.0071 1.0065 1.0071 1.0154 1.0188 1.0075 0.9872 1.0024 1.0069 1.0085 1.0064 1.0028 1.0195 1.0094 1.0056 1.0023 1.0025 1.0048 1.0052 1.0030 1.0030
dispcorr: -0.026683536 hartree
energy: -1329.003481423621
dipole: 22.04204 -22.38032 -0.33828 -3.22658 2.66145 -0.56513 -17.11137 16.23044 -0.88093
magnitude: 1.09993 au
magnitude: 2.79579 debye
