program: Orca
programVersion: 5.0.2
elementType: Cl O O N C C C C C C C C C C C C C C C C C H H H H H H H H H H H H H H H H H H H H H H H H H H
charge: 0
multiplicity: 1
keywords: wb97x-d3
keywords: def2-TZVPP
keywords: def2/J RIJCOSX
keywords: DEFGRID2
keywords: scfconv7
keywords: smallprint printgap noloewdin
keywords: NOSOSCF
formula: C17H26ClNO2
InChI: InChI=1/C17H26ClNO2/c1-4-7-11-21-13-19(16(20)12-18)17-14(5-2)9-8-10-15(17)6-3/h8-10H,4-7,11-13H2,1-3H3
47 atoms
Cl -3.243384 1.94182 1.056118
O  2.123428 0.430768 -0.150943
O  -0.032231 2.586114 2.009268
N  -0.112198 0.973021 0.410194
C  -0.703922 -0.224471 -0.083116
C  -0.410683 -1.444428 0.543797
C  -1.515582 -0.168002 -1.22211
C  0.474861 -1.563912 1.759858
C  -1.801499 1.11083 -1.963707
C  1.131243 1.402302 -0.211428
C  -0.963953 -2.605057 0.014352
C  -2.055436 -1.35365 -1.708923
C  3.500683 -1.261428 -1.101492
C  2.318747 -0.340598 -1.319144
C  -1.783522 -2.564506 -1.099424
C  -0.595296 1.646237 1.497784
C  4.819255 -0.536315 -0.863612
C  -0.270859 -2.039715 3.005835
C  -1.131094 1.150445 -3.336279
C  -1.946296 1.191372 2.029467
C  5.984499 -1.498287 -0.683594
H  0.98345 -0.626719 1.971386
H  1.269931 -2.279006 1.531579
H  -1.496521 1.975748 -1.377242
H  -2.882322 1.208396 -2.088454
H  1.470759 2.28391 0.327961
H  0.927638 1.687009 -1.251122
H  -0.741398 -3.557404 0.481056
H  -2.699942 -1.322961 -2.579522
H  3.587007 -1.90243 -1.984425
H  3.283884 -1.93008 -0.262313
H  2.514399 0.317818 -2.178694
H  1.428556 -0.932673 -1.562063
H  -2.207844 -3.478472 -1.49396
H  5.021832 0.128974 -1.708983
H  4.731539 0.105513 0.014662
H  -1.042959 -1.334016 3.313058
H  0.417451 -2.151298 3.843531
H  -0.756644 -3.002572 2.847276
H  -0.047169 1.057738 -3.256958
H  -1.347968 2.089823 -3.844941
H  -1.477639 0.339742 -3.977449
H  -2.102418 0.117222 1.997397
H  -2.048618 1.549758 3.050306
H  6.118463 -2.131973 -1.562387
H  5.825868 -2.15596 0.172871
H  6.920492 -0.964772 -0.517847
totalener: -1328.97364288 hartree
nucrepener: 1983.11021015 hartree
electener: -3312.08385303 hartree
oneelecener: -5757.06975709 hartree
twoeener: 2444.98590405 hartree
kineticenergy: 1324.31720077 hartree
xcener: -107.429460685890 hartree
chargesum: -0.0000000
charge: -0.127492 -0.321761 -0.371143 -0.000047 0.026665 -0.146490 -0.065082 -0.191225 -0.203711 0.047720 -0.017584 -0.041202 -0.135452 0.011544 -0.174489 0.267132 -0.063516 -0.228593 -0.231450 -0.101530 -0.259556 0.097994 0.082468 0.080374 0.094795 0.111866 0.102979 0.116222 0.114969 0.062698 0.059689 0.081655 0.099970 0.125293 0.045548 0.071344 0.071068 0.094057 0.076529 0.063792 0.094270 0.078250 0.122550 0.150002 0.070028 0.073215 0.085637
qa: -0.1275 -0.3218 -0.3711 -0.0000 0.0267 -0.1465 -0.0651 -0.1912 -0.2037 0.0477 -0.0176 -0.0412 -0.1355 0.0115 -0.1745 0.2671 -0.0635 -0.2286 -0.2315 -0.1015 -0.2596 0.0980 0.0825 0.0804 0.0948 0.1119 0.1030 0.1162 0.1150 0.0627 0.0597 0.0817 0.1000 0.1253 0.0455 0.0713 0.0711 0.0941 0.0765 0.0638 0.0943 0.0783 0.1226 0.1500 0.0700 0.0732 0.0856
va: 1.1502 1.9627 2.1418 2.9295 3.6589 3.7744 3.7402 3.8995 3.8899 3.9277 3.8349 3.8633 3.9685 3.8820 4.0560 4.1411 3.8519 3.9220 3.9318 3.9661 3.9542 1.0249 1.0024 1.0218 1.0018 1.0459 0.9920 1.0026 1.0039 1.0146 1.0130 0.9966 0.9806 1.0023 1.0106 1.0224 1.0112 1.0071 1.0067 1.0106 1.0076 1.0078 1.0136 1.0042 1.0021 1.0030 1.0061
dispcorr: -0.027717678 hartree
energy: -1329.001360558181
dipole: 28.19434 -28.16250 0.03184 -17.01867 15.63755 -1.38113 -11.28759 10.36968 -0.91790
magnitude: 1.65864 au
magnitude: 4.21592 debye
