program: Orca
programVersion: 5.0.2
elementType: Cl O O N C C C C C C C C C C C C C C C C C H H H H H H H H H H H H H H H H H H H H H H H H H H
charge: 0
multiplicity: 1
keywords: wb97x-d3
keywords: def2-TZVPP
keywords: def2/J RIJCOSX
keywords: DEFGRID2
keywords: scfconv7
keywords: smallprint printgap noloewdin
keywords: NOSOSCF
formula: C17H26ClNO2
InChI: InChI=1/C17H26ClNO2/c1-4-7-11-21-13-19(16(20)12-18)17-14(5-2)9-8-10-15(17)6-3/h8-10H,4-7,11-13H2,1-3H3
47 atoms
Cl -2.435071 1.454031 2.477866
O  2.295237 -0.266009 -0.41286
O  0.61071 2.062878 1.470774
N  0.082339 0.119008 0.430125
C  -0.896378 -0.70504 -0.204377
C  -1.5974 -1.64453 0.566162
C  -1.113825 -0.58107 -1.582032
C  -1.29335 -1.859582 2.029175
C  -0.341666 0.37201 -2.457386
C  1.411561 -0.441256 0.641717
C  -2.562204 -2.421616 -0.066721
C  -2.092593 -1.375922 -2.168766
C  3.987624 0.964425 -1.553922
C  2.887596 1.014616 -0.514709
C  -2.818066 -2.283004 -1.418883
C  -0.216231 1.34762 0.953565
C  5.135706 0.025447 -1.205436
C  -2.498406 -2.21153 2.893124
C  -0.941457 1.773634 -2.540287
C  -1.672098 1.793004 0.897611
C  6.270225 0.099024 -2.21656
H  -0.818063 -0.973608 2.447331
H  -0.549835 -2.660185 2.111516
H  -0.313205 -0.050862 -3.46399
H  0.694368 0.427394 -2.130318
H  1.290502 -1.518117 0.759288
H  1.80855 -0.025915 1.573239
H  -3.1238 -3.149007 0.503751
H  -2.275499 -1.287158 -3.232912
H  4.371668 1.98296 -1.670369
H  3.562707 0.688607 -2.524525
H  3.295846 1.323945 0.456615
H  2.144861 1.769765 -0.798423
H  -3.574158 -2.896248 -1.891376
H  5.516929 0.276126 -0.210567
H  4.764763 -0.999008 -1.140122
H  -2.921323 -3.185503 2.648156
H  -3.284036 -1.464228 2.790468
H  -2.206579 -2.246627 3.942275
H  -1.994715 1.741605 -2.821314
H  -0.416688 2.369947 -3.286794
H  -0.864619 2.311534 -1.595702
H  -1.696466 2.870222 0.750695
H  -2.270848 1.304542 0.134993
H  7.077718 -0.587547 -1.961859
H  6.695924 1.102826 -2.264851
H  5.925385 -0.15808 -3.219604
totalener: -1328.97690342 hartree
nucrepener: 1956.65691663 hartree
electener: -3285.63382005 hartree
oneelecener: -5704.27958141 hartree
twoeener: 2418.64576136 hartree
kineticenergy: 1324.29648783 hartree
xcener: -107.424678904321 hartree
chargesum: 0.0000000
charge: -0.122517 -0.325479 -0.366510 0.018172 -0.013765 -0.072099 -0.093193 -0.218052 -0.190258 0.105220 -0.053665 -0.035994 -0.111787 -0.022130 -0.156441 0.226528 -0.065648 -0.245616 -0.272746 -0.110212 -0.257120 0.097706 0.091272 0.080482 0.091235 0.095096 0.108391 0.116854 0.110746 0.059461 0.061938 0.101820 0.090169 0.126299 0.046052 0.065950 0.078373 0.086623 0.091085 0.094825 0.097048 0.077307 0.149608 0.137902 0.083954 0.070462 0.072654
qa: -0.1225 -0.3255 -0.3665 0.0182 -0.0138 -0.0721 -0.0932 -0.2181 -0.1903 0.1052 -0.0537 -0.0360 -0.1118 -0.0221 -0.1564 0.2265 -0.0656 -0.2456 -0.2727 -0.1102 -0.2571 0.0977 0.0913 0.0805 0.0912 0.0951 0.1084 0.1169 0.1107 0.0595 0.0619 0.1018 0.0902 0.1263 0.0461 0.0660 0.0784 0.0866 0.0911 0.0948 0.0970 0.0773 0.1496 0.1379 0.0840 0.0705 0.0727
va: 1.1560 1.9721 2.1361 2.8776 3.9001 3.7981 3.8599 3.8979 3.9085 3.9811 3.8777 3.8533 3.9140 3.8920 4.0454 4.1473 3.8570 3.9320 3.9095 3.9879 3.9508 1.0083 0.9972 1.0108 1.0202 0.9982 1.0063 1.0066 1.0073 1.0130 1.0123 1.0052 0.9937 1.0021 1.0115 1.0215 1.0028 1.0194 1.0067 1.0022 1.0091 1.0062 1.0023 1.0049 1.0062 1.0028 1.0029
dispcorr: -0.026784487 hartree
energy: -1329.003687904055
dipole: 22.70532 -23.04844 -0.34313 -5.15706 4.51026 -0.64679 -16.61454 15.75650 -0.85804
magnitude: 1.12797 au
magnitude: 2.86707 debye
