program: Orca
programVersion: 5.0.2
elementType: Cl O O N C C C C C C C C C C C C C C C C C H H H H H H H H H H H H H H H H H H H H H H H H H H
charge: 0
multiplicity: 1
keywords: wb97x-d3
keywords: def2-TZVPP
keywords: def2/J RIJCOSX
keywords: DEFGRID2
keywords: scfconv7
keywords: smallprint printgap noloewdin
keywords: NOSOSCF
formula: C17H26ClNO2
InChI: InChI=1/C17H26ClNO2/c1-4-7-11-21-13-19(16(20)12-18)17-14(5-2)9-8-10-15(17)6-3/h8-10H,4-7,11-13H2,1-3H3
47 atoms
Cl -3.246281 1.273592 1.77653
O  2.238583 0.458338 0.332293
O  -0.306028 2.948321 1.542466
N  -0.063372 0.81647 0.795376
C  -0.569699 -0.2742 0.032668
C  -1.106511 -1.383859 0.695749
C  -0.473798 -0.236637 -1.366016
C  -1.175445 -1.490069 2.196387
C  0.119653 0.923437 -2.125666
C  1.289134 0.696806 1.318873
C  -1.572527 -2.448667 -0.068048
C  -0.948189 -1.326651 -2.087648
C  3.885337 -0.922067 -0.706077
C  2.642833 -0.885563 0.159573
C  -1.49743 -2.423878 -1.448358
C  -0.762409 1.97618 0.986768
C  3.678395 -0.398121 -2.12178
C  -0.21955 -2.545198 2.750985
C  -0.892858 1.667493 -2.994075
C  -2.207196 1.984824 0.50829
C  4.935733 -0.509265 -2.971694
H  -2.198408 -1.745727 2.481642
H  -0.975714 -0.527024 2.663469
H  0.912565 0.534861 -2.769005
H  0.612075 1.621761 -1.452814
H  1.307524 -0.100022 2.073424
H  1.525549 1.639644 1.807453
H  -2.004697 -3.307918 0.431046
H  -0.878663 -1.316139 -3.16899
H  4.224046 -1.96213 -0.749915
H  4.684891 -0.359563 -0.214848
H  1.848415 -1.487694 -0.29945
H  2.865119 -1.339642 1.135644
H  -1.864501 -3.261537 -2.026854
H  2.864384 -0.956691 -2.595496
H  3.353746 0.643347 -2.081658
H  0.816811 -2.323542 2.493157
H  -0.443418 -3.537611 2.359132
H  -0.288331 -2.595848 3.837698
H  -1.683962 2.124771 -2.399862
H  -1.37128 1.007453 -3.71775
H  -0.402867 2.466286 -3.550657
H  -2.513625 3.018259 0.369931
H  -2.383873 1.420472 -0.402219
H  4.773349 -0.123835 -3.978367
H  5.263159 -1.54617 -3.065513
H  5.760156 0.055677 -2.533767
totalener: -1328.97339785 hartree
nucrepener: 1997.28294568 hartree
electener: -3326.25634353 hartree
oneelecener: -5785.37700913 hartree
twoeener: 2459.12066559 hartree
kineticenergy: 1324.31253154 hartree
xcener: -107.429517512775 hartree
chargesum: -0.0000000
charge: -0.127423 -0.316450 -0.371690 0.003590 0.029640 -0.067570 -0.139266 -0.203703 -0.203635 0.042132 -0.040047 -0.018483 -0.117022 0.018552 -0.173682 0.269967 -0.069833 -0.232673 -0.228440 -0.106236 -0.263853 0.094542 0.080089 0.083600 0.102558 0.103647 0.112874 0.114309 0.115506 0.056173 0.063636 0.083582 0.081796 0.126644 0.039902 0.069998 0.064041 0.078440 0.094652 0.072505 0.076656 0.093475 0.150143 0.123540 0.084341 0.072666 0.076809
qa: -0.1274 -0.3164 -0.3717 0.0036 0.0296 -0.0676 -0.1393 -0.2037 -0.2036 0.0421 -0.0400 -0.0185 -0.1170 0.0186 -0.1737 0.2700 -0.0698 -0.2327 -0.2284 -0.1062 -0.2639 0.0945 0.0801 0.0836 0.1026 0.1036 0.1129 0.1143 0.1155 0.0562 0.0636 0.0836 0.0818 0.1266 0.0399 0.0700 0.0640 0.0784 0.0947 0.0725 0.0767 0.0935 0.1501 0.1235 0.0843 0.0727 0.0768
va: 1.1501 1.9745 2.1419 2.9299 3.6646 3.7442 3.7362 3.8916 3.8990 3.9322 3.8631 3.8228 3.9634 3.9015 4.0546 4.1351 3.8559 3.9311 3.9300 3.9722 3.9629 1.0021 1.0211 1.0055 1.0198 0.9920 1.0455 1.0040 1.0032 1.0127 1.0193 0.9764 0.9998 1.0017 1.0077 1.0132 1.0120 1.0079 1.0077 1.0113 1.0063 1.0072 1.0036 1.0128 1.0055 1.0018 1.0026
dispcorr: -0.028556600 hartree
energy: -1329.001954451043
dipole: 26.67961 -26.48894 0.19067 -13.45187 12.00826 -1.44361 -16.88206 16.03198 -0.85008
magnitude: 1.68612 au
magnitude: 4.28577 debye
